{"text_format":"1","workbook":"xlsx","n_sheets":19,"sheets":["Handleiding","Reglement","Basis","voorbeeld Paarden B","Pa-zonder","Ring 1 - Bpaarden","Ring 2 - Bpaarden","Ring 3 - Lpaarden","Ring 4 - Lpaarden","Ring 2 M-CDE","Paarden M","Paarden Z","Pony's B-ABC","Ring 3 - L-DE","Ring 3 - L-ABC","BB Paarden","Ring 4 - B-CD","BB Pony's","Pony's Z-CDE"],"not_rendered":{"charts":0,"images":0,"macros":1,"external_links":0,"defined_names":75,"comments":0,"pivot_tables":0},"unopened":[],"bounds":{"document_bytes":16777216,"sheet_cells":100000,"rows_first":2000,"rows_last":500,"rows_between":2000,"halvings":0,"cell_chars":16384,"cell_head_chars":4096},"cells_cut":0,"cells_raw":0,"read":"whole","date_system":"1900"}

{"sheet":"Handleiding","index":0,"n_rows":49,"n_cols":6,"rows_kept":49,"cut":false,"hidden":false,"merged":[]}
[null,"KNHS Eventingwedstrijden."]
[]
[null,"Handleiding bij het programma \"Uitslagverwerking SGW\"    versie 1.5 d.d. do. 21.12.2017"]
[]
[1,"Bewaar dit basisbestand ongewijzigd op je PC."]
[2,"Maak een kopie van het basisbestand en geef deze een herkenbare naam (plaatsnaam wedstrijd, jaar,…)."]
[3,"Sla deze kopie op in een nieuwe map, geef deze map een herkenbare naam en werk hierin verder."]
[4,"Open dat bestand en \"Macro's inschakelen\".",null,null,null," "]
[5,"Verwijder de overbodige tabbladen (klassen of categoriën die op je wedstrijd niet voorkomen).",null,null,null," "]
[6,"Tabblad Basis : vul de plaatselijke gegevens in (enkel de gele velden kunnen ingevuld worden).",null,null,null," "]
[7,"De formules passen nu de crosstijden etc. in alle volgende werkbladen aan."]
[8,"Wis (delete) per klasse de kolommen van de niet-bestaande crosshindernissen (nummer en alle streepjes)  "]
[9,"Kopieer dan elk tabblad per klasse zo vaak als er ringen in die klasse zijn."]
[10,"Pas de naam van elk tabblad en de titel (cel G1) aan (bv :  Paarden L ring 2 / Paarden L ring 3 / … )."]
[11,"Vul de naam van de dressuurjury in : cel L1"]
[12,"Voeg de gegevens van de deelnemers in met \"Kopiëren / Bewerken / Plakken speciaal / Waarden\"."]
[13,"Dit gebeurt best uit je wedstrijdprogramma (opgemaakte startlijsten …)."]
[14,"Indien van toepassing zet je in kolom A : \"HC\" (Hors Concours = buiten mededinging)."]
[15,"Elk werkblad is beveiligd, behalve de gele cellen en de cellen voor de deelnemer-gegevens."]
[16,"Deze beveiliging kan echter uitgezet worden (zonder wachtwoord) via \"Extra / Beveiliging / Blad ...\"."]
[17,"Dit dient bv te gebeuren om rijen in te voegen of om te sorteren, maar beveilig nadien opnieuw ! (OK)"]
[18,"Bij meer dan 25 deelnemers in 1 ring, rijen invoegen, mits ALLE formules te kopiëren (volledige rijen !!!)."]
[19,"Verwijder NOOIT rijen of kolommen, indien nodig of gewenst : enkel verbergen."]
[20,"Sorteer indien nodig de deelnemers op rugnummer (kolom C). Dus even beveiling AF / OP."]
[21,"Vul de behaalde wedstrijdgegevens per deelnemer in : positieve punten dressuur (kolom I, klasse Z : H en I)."]
[22,"Indien in klasse B geen dressuur wordt gereden : elke deelnemer 150 ptn toekennen (= 50 strafpunten)."]
[23,"Wie niet start in dressuur : \"NG\" (niet gestart) in kolom I, bij uitsluiting \"Uit\" (uitsluiting) in I en \"dress\"in AY ."]
[24,"Zo ook na het springen : de hindernis- en tijdsfouten; indien foutloos : 0 invullen !"]
[25,"Wie niet start in het springen : \"NG\" in kolom K (hindernisfouten), bij uitsluiting \"Uit\" in K en \"spr\" in AY."]
[26,"Bij ingeven van de cross MOET kolom Y (hindernis 1) ingevuld worden : 0 of 20 of 60 of … of NG"]
[27,"Hindernisfouten in kolommen Z tot AW : 20 / 60 / 3W / VP / VR / FP / VrV; bij foutloos : streepje laten staan !"]
[28,"Na verlaten parcours (door VrV of Uit) : delete alle verdere streepjes / bij doorrijden : streepjes laten staan !"]
[29,"In voorkomend geval : de somformule in kolom AX overschrijven door Uit of VrV."]
[30,"Deze groene kolom AX bevat formules, maar is NIET beveiligd."]
[31,"Indien Uit : reden, en eventueel hindernis vermelden in kolom AY."]
[32,"Indien andere reden van uitsluiting dan automatisch vermeld (bv. dierenarts) : in kolom AY."]
[33,"Tijd van de cross : de minuten in kolom N, de seconden in kolom O invullen, het : komt automatisch."]
[34,"Optioneel kunnen start- en aankomsturen ingevoerd worden in kolommen BC en BD (uu:mm:ss)."]
[35,"Klasse B : beide totalen van de stijlcijfers invullen in kolommen BP en BQ. (cfr. tabblad Reglement, punt 2)  "]
[36,"Indien één van beide stijlpunten ontbreekt en cross uitgereden : in beide kolommen zelfde punten ingeven."]
[37,"Tussen- of einduitslag : blok met volledige rijen sorteren op kolom U / OPLOPEND ! (beveiliging AF / OP)."]
[38,"Nummer kolom A volgens het klassement (HC-combinaties onderaan) en dikke streep onder geclasseerden."]
[39,"Ex-aequo's sorteren volgens reglement; uitsluitingen vlgs logica (mits rankingcijfers te wissen na sorteren)."]
[40,"Om enkel resultatenblad of verzamelstaat van de hindernissen te printen : gebruik de buttons onderaan."]
[41,"Vergeet niet regelmatig het bestand op te slaan + kopie op externe data-drager (USB-stick …) ! ! !"]
[42,"Publiceer de uitslagen via mail of internet niet in Excel, maar als PDF ! (behalve aan KNHS … !)"]
[43,"Wijzig NIETS aan de formules a.u.b. ! Eventuele vragen, opmerkingen, suggesties : G.Naber@knhs.nl"]
[]
[null,"2017-12-21T17:00:00"]

{"sheet":"Reglement","index":1,"n_rows":34,"n_cols":4,"rows_kept":34,"cut":false,"hidden":false,"merged":[]}
[]
[null,"KNHS Eventingwedstrijden."]
[]
[null,"Memo reglement t.b.v. rekenkamer"]
[null,null,"telkens te verifiëren met laatste versie en jaar van het reglement !"]
[]
[1,"strafpunten cross :","1ste weigering (of volte, uitbreken) :",20]
[null,null,"2de weigering op dezelfde hindernis :",40]
[null,null,"3de weigering op dezelfde hindernis (klasse t/m L) :","uitsluiting"]
[null,null,"4 weigeringen totaal (klasse t/m L) :","uitsluiting"]
[null,null,"3 weigeringen totaal (klasse M en Z) :","uitsluiting"]
[null,null,"val ruiter en/of paard :","uitsluiting"]
[null,null,"van laatste hindernis tot finish niet in galop in rechte lijn (wijziging 2016)",4]
[2,"stijlpunten (klasse B) :","per stijljury wordt het gemiddelde gemaakt :"]
[null,null,"som van de 3 getallen (hele of halve punten) gedeeld door 3"]
[null,null,"en afgerond op 1 decimaal (dus b.v. 6,0 of 6,2 of 6,7 of ...)."]
[null,null,"Zie hiervoor kolommen BP tot BS "]
[3,"uitsluiting dressuur :","45% of minder (cfr. tabblad Basis : kolom M)"]
[4,"uitsluiting springen :","meer dan 20 strafpunten, exclusief de tijdsoverschrijving (cfr. Basis : kolom N) "]
[5,"uitsluiting cross :","overschrijden van gemiddelde snelheid 225 m/min (paarden), 200 m/min (pony's) "]
[null,null,"cfr. Basis : kolommen O en P."]
[6,"uitsluiting dierenarts","na springen","\"vet spr\""]
[null,null,"na cross","\"vet cr\""]
[7,"aantal geclasseerden :","aantal starters in dressuur - aantal HC, delen door 4 / naar boven afronden"]
[]
[8,"reglement ex-equo :","Bij een gelijk aantal strafpunten is de winnaar :"]
[null,"(wijziging 2017)","a. De combinatie met het minst aantal strafpunten in de crosscountry"]
[null,null,"b. Daarna de combinatie die de toegestane tijd in de crosscountry het dichtst benadert"]
[null,null,"c. Daarna de combinatie met het beste springresultaat"]
[null,null,"d. Daarna de combinatie met de snelste tijd in het springen"]
[null,null,"e. Daarna worden de betreffende combinaties gelijk geplaatst."]
[]
[9,"berekening dressuur :","De coëfficiënt x 1,5 vervalt. Dit is aangepast in de formules."]
[null,"(wijziging 2018  cfr.FEI)","Bij klasse B zonder dressuur : nu elke deelnemer 150 ptn toekennen (= 50 strafpunten)."]

{"sheet":"Basis","index":2,"n_rows":28,"n_cols":25,"rows_kept":28,"cut":false,"hidden":false,"merged":[[27,9,27,14],[3,7,3,8],[3,9,3,10],[16,7,16,8],[16,9,16,10],[16,14,16,15],[16,22,16,23],[2,20,2,23],[3,14,3,15],[3,22,3,23],[15,20,15,23]]}
[null," KNHS Samengestelde wedstrijd",null,null,null,{"$f":"D5","v":"Eventing Leende 30 juni 2018"}]
[]
[null," Parameters te wijzigingen per wedstrijd : gele cellen",null,null,null,null,null,null,null,null,null,null,null,null,null,null,null,null,null,null,"Hulpkolommen uitsluitingstijd cross",null,null,null,"Coëfficiënt dressuur"]
[null,null,null,null,null,"opt. tijd","minim. tijd","opt. tijd",null,"minim. tijd",null,"max.","uitsluiting","uitsluiting","uitsluiting\ncrosstijd",null,null,null,null,null,"uitsl. tijd",null,"uitsl. tijd",null,2018]
[null," Plaats en jaar wedstrijd :",null,"Eventing Leende 30 juni 2018",null,"sec.","sec.","min.","sec.","min.","sec.","dress.","dressuur","springen","min.","sec",null,null,null,null,"sec.",null,"min.","sec."]
["Klasse",null,"Lengte (m)"," Snelheid (m/min)",null,null,null,null,null,null,null,null,"= of <","hind.ftn >",null,null,null,null,null,null,225,null,null,null,1]
[]
["B","Cross :",1680,460,null,{"$f":"CEILING(C8/(D8/60),1)","v":220},{"$f":"F8-20","v":200},{"$f":"INT(F8/60)","v":3},{"$f":"F8-(H8*60)","v":40},{"$f":"INT(G8/60)","v":3},{"$f":"G8-(J8*60)","v":20},300,{"$f":"L8*45/100","v":135},20,{"$f":"W8","v":7},28,null,null,null,null,{"$f":"CEILING(C8/(U$6/60),1)","v":448},null,{"$f":"INT(U8/60)","v":7},{"$f":"U8-(W8*60)","v":28}]
["L","Cross :",2040,480,null,{"$f":"CEILING(C9/(D9/60),1)","v":255},{"$f":"F9-20","v":235},{"$f":"INT(F9/60)","v":4},{"$f":"F9-(H9*60)","v":15},{"$f":"INT(G9/60)","v":3},{"$f":"G9-(J9*60)","v":55},300,{"$f":"L9*45/100","v":135},{"$f":"N$8","v":20},9,4,null,null,null,null,{"$f":"CEILING(C9/(U$6/60),1)","v":544},null,{"$f":"INT(U9/60)","v":9},{"$f":"U9-(W9*60)","v":4}]
["M","Cross :",2300,500,null,{"$f":"CEILING(C10/(D10/60),1)","v":276},{"$f":"F10-20","v":256},{"$f":"INT(F10/60)","v":4},{"$f":"F10-(H10*60)","v":36},{"$f":"INT(G10/60)","v":4},{"$f":"G10-(J10*60)","v":16},300,{"$f":"L10*45/100","v":135},{"$f":"N$8","v":20},10,14,null,null,null,null,{"$f":"CEILING(C10/(U$6/60),1)","v":614},null,{"$f":"INT(U10/60)","v":10},{"$f":"U10-(W10*60)","v":14}]
["Z","Cross :",2600,520,null,{"$f":"CEILING(C11/(D11/60),1)","v":300},{"$f":"F11-20","v":280},{"$f":"INT(F11/60)","v":5},{"$f":"F11-(H11*60)","v":0},{"$f":"INT(G11/60)","v":4},{"$f":"G11-(J11*60)","v":40},230,{"$f":"L11*45/100","v":103.5},{"$f":"N$8","v":20},11,34,null,null,null,null,{"$f":"CEILING(C11/(U$6/60),1)","v":694},null,{"$f":"INT(U11/60)","v":11},{"$f":"U11-(W11*60)","v":34}]
[]
[]
[null," KNHS Samengestelde wedstrijd ",null,null,null,{"$f":"D18","v":"Eventing Leende 30 juni 2018"}]
[]
[null," Parameters te wijzigingen per wedstrijd : gele cellen",null,null,null,null,null,null,null,null,null,null,null,null,null,null,null,null,null,null,"Hulpkolommen uitsluitingstijd cross",null,null,null,"Coëfficiënt dressuur"]
[null,null,null,null,null,"opt. tijd","minim. tijd","opt. tijd",null,"minim. tijd",null,"max.","uitsluiting","uitsluiting","uitsluiting\ncrosstijd",null,null,null,null,null,"uitsl. tijd",null,"uitsl. tijd",null,2018]
[null," Plaats en jaar wedstrijd :",null,"Eventing Leende 30 juni 2018",null,"sec.","sec.","min.","sec.","min.","sec.","dress.","dressuur","springen","min.","sec",null,null,null,null,"sec.",null,"min.","sec."]
[" Klasse / Categorie",null,"Lengte (m)"," Snelheid (m/min)",null,null,null,null,null,null,null,null,"= of <","hind.ftn >",null,null,null,null,null,null,200,null,null,null,1]
["B / B","Cross : ",1660,420,null,{"$f":"CEILING(C20/(D20/60),1)","v":238},{"$f":"F20-20","v":218},{"$f":"INT(F20/60)","v":3},{"$f":"F20-(H20*60)","v":58},{"$f":"INT(G20/60)","v":3},{"$f":"G20-(J20*60)","v":38},300,{"$f":"L20*45/100","v":135},{"$f":"N$8","v":20},{"$f":"W20","v":8},18,null,null,null,null,{"$f":"CEILING(C20/(U$19/60),1)","v":498},null,{"$f":"INT(U20/60)","v":8},{"$f":"U20-(W20*60)","v":18}]
["B / C","Cross : ",1660,440,null,{"$f":"CEILING(C21/(D21/60),1)","v":227},{"$f":"F21-20","v":207},{"$f":"INT(F21/60)","v":3},{"$f":"F21-(H21*60)","v":47},{"$f":"INT(G21/60)","v":3},{"$f":"G21-(J21*60)","v":27},300,{"$f":"L21*45/100","v":135},20,{"$f":"W21","v":8},{"$f":"X21","v":18},null,null,null,null,{"$f":"CEILING(C21/(U$19/60),1)","v":498},null,{"$f":"INT(U21/60)","v":8},{"$f":"U21-(W21*60)","v":18}]
["B / DE","Cross : ",1660,450,null,222,202,3,42,3,22,300,135,20,8,18,null,null,null,null,498,null,8,18]
["L / B","Cross : ",1680,430,null,235,215,3,55,3,35,300,135,20,8,24,null,null,null,null,504,null,8,24]
["L / C","Cross : ",1680,450,null,{"$f":"CEILING(C24/(D24/60),1)","v":224},{"$f":"F24-20","v":204},{"$f":"INT(F24/60)","v":3},{"$f":"F24-(H24*60)","v":44},{"$f":"INT(G24/60)","v":3},{"$f":"G24-(J24*60)","v":24},300,{"$f":"L24*45/100","v":135},20,{"$f":"W24","v":8},{"$f":"X24","v":24},null,null,null,null,{"$f":"CEILING(C24/(U$19/60),1)","v":504},null,{"$f":"INT(U24/60)","v":8},{"$f":"U24-(W24*60)","v":24}]
["L / DE","Cross : ",1680,460,null,220,200,3,40,3,20,300,135,20,8,24,null,null,null,null,504,null,8,24]
["M / CDE","Cross : ",2040,480,null,255,235,4,15,3,55,300,135,20,10,12,null,null,null,null,612,null,10,12]
["Z / CDE","Cross : ",2200,500,null,264,244,4,24,4,4,220,99,20,11,0,null,null,null,null,660,null,11,0]
[null,null,null,null,null,null,null,null,null,{"$f":"NOW()","v":"2018-06-30T22:02:24.880"}]

{"sheet":"voorbeeld Paarden B","index":3,"n_rows":31,"n_cols":71,"rows_kept":31,"cut":false,"hidden":false,"merged":[[2,13,2,14],[29,15,29,21],[29,46,29,52]]}
[{"$f":"\" Samengestelde wedstrijd \"&Basis!D5","v":" Samengestelde wedstrijd Eventing Leende 30 juni 2018"},null,null,null,null,null,"Klasse B - Ring 1",null,null,null,"Dressuurjury : ","Jan Ruyterkamp",null,null,null,null,null,null,null,null,null,null,null," Verzamelstaat hindernisfouten in de cross",null,null,null,null,null,null,null,null,null,null,null,null,{"$f":"A1","v":" Samengestelde wedstrijd Eventing Leende 30 juni 2018"},null,null,null,null,null,null,null,null,null,null,null,null,null,null,null,{"$f":"G1&\" \"","v":"Klasse B - Ring 1 "},null," Indien aankomstUUR cross wordt meegedeeld :",null,null,null,null,null," Hulpkolommen",null,null,null,null,null,null," Stijlcijfers :"]
["rank",null,"rugnr","combinatie nr","naam ruiter","naam paard","vereniging / plaats",null,"dressuur","dressuur","hind.ft.","tijd.ft.","hind.ft.","min","sec","tijd.ft.",null,"totaal","(1) stijl","(2) stijl","eind-","reden",null,null,"hindernisnummer",null,null,null,null,null,null,null,null,null,null,null,null,null,null,null,null,null,null,null,null,null,null,null,null,null," ",null,null,null,null,null,null,null,null,null,"Uitslag","NA","tijd (sec)","tijd.ft.","reg.ft.","totaal",null,"Totaal","Totaal","Gemiddelde","Gemiddelde"]
["HC",null,null,null,null,null,null,null,"totaal","strafpntn.","springen","springen","cross","cross",null,{"$f":"Basis!$H$8&\":\"&TEXT(Basis!$I$8,\"00\")","v":"3:40"},null,null,"cijfer","cijfer","totaal","uitsluiting",null,"nr",1,2,3,4,5,6,7,8,9,10,11,12,13,14,15,16,17,18,19,20,null,null,null,null,null,"totaal","reden uitsluiting","hind.","nr",null,"Vertrekuur","Aankomst","Tijd","Minuten","Seconden",null,"Springen","Springen","cross","opt.tijd =",{"$f":"Basis!$H$8&\":\"&TEXT(Basis!$I$8,\"00\")","v":"3:40"},"cross",null,"Jury 1","Jury 2","Jury 1","Jury 2"]
[null,null,null,null,null,null,null,null,null,null,null,null,null,null,null,null,null,{"$f":"IF(ISBLANK(I4),\"\",IF(AND(ISBLANK(K4),ISBLANK(Y4)),J4,IF(ISTEXT(K4),K4,IF(OR(ISBLANK(M4),M4=\"\"),J4+K4+L4,IF(ISTEXT(M4),M4,IF(ISBLANK(Y4),J4+K4+L4,J4+K4+L4+M4+P4+Q4))))))","v":""}]
[null,null,1,"voorbeeld","voorbeeld","voorbeeld","voorbeeld",null,190,{"$f":"IF(I5=\"\",\"\",IF(ISTEXT(I5),I5,IF(I5<=Basis!$M$8,\"Uit\",(100-(I5/Basis!$L$8*100))*Basis!$Y$6)))","v":36.666666666666671},4,1,{"$f":"IF(AX5=\"\",\"\",AX5)","v":20},{"$f":"IF(ISBLANK(BD5),\"\",BF5)","v":5},{"$f":"IF(ISBLANK(BD5),\"\",BG5)","v":15},{"$f":"IF(N5=\"\",\"\",IF(N5*60+O5>Basis!$U$8,\"Uit\",BL5+BM5))","v":38},null,{"$f":"IF(ISTEXT(BJ5),BJ5,IF(OR(ISBLANK(M5),M5=\"\",ISBLANK(Y5)),BJ5,IF(ISTEXT(BN5),BN5,BJ5+BN5)))","v":99.666666666666671},{"$f":"IF(BP5=\"\",\"\",BR5)","v":7.5},{"$f":"IF(BQ5=\"\",\"\",BS5)","v":6.5},{"$f":"IF(R5=\"\",\"\",IF(ISTEXT(R5),R5,IF(BP5=\"\",\"\",R5-S5-T5)))","v":85.666666666666671},{"$f":"IF(AY5=\"\",\"\",AY5)","v":""},null,{"$f":"IF($C5=\"\",\"\",$C5)","v":1},0,"-","-","-","-","-","-","-","-",20,"-","-","-","-","-","-","-","-","-","-",null,null,null,null,null,{"$f":"IF(Y5=\"\",\"\",IF(ISTEXT(Y5),Y5,SUM(Y5:AW5)))","v":20},null,null,{"$f":"IF($C5=\"\",\"\",$C5)","v":1},null,"10:00:00","10:05:15",{"$f":"IF(ISBLANK(BD5),\"\",BD5-BC5)","v":"00:05:15"},{"$f":"IF(ISBLANK(BD5),\"\",MINUTE(BE5))","v":5},{"$f":"IF(ISBLANK(BD5),\"\",SECOND(BE5))","v":15},null,{"$f":"IF(K5=\"\",\"\",IF(ISTEXT(K5),K5,IF(K5>Basis!$N$8,\"Uit\",IF(ISBLANK(L5),K5,K5+L5))))","v":5},{"$f":"IF(OR(ISTEXT(J5),BI5=\"\"),J5,IF(ISTEXT(BI5),BI5,J5+BI5))","v":41.666666666666671},{"$f":"IF(N5=\"\",\"\",N5*60+O5)","v":315},{"$f":"IF(N5=\"\",\"\",IF(BK5<=Basis!$F$8,0,(BK5-Basis!$F$8)*0.4))","v":38},{"$f":"IF(N5=\"\",\"\",IF(BK5>Basis!$G$8,0,(Basis!$G$8-BK5)*0.4))","v":0},{"$f":"IF(M5=\"\",\"\",IF(ISTEXT(M5),M5,IF(ISTEXT(P5),P5,M5+P5)))","v":58},null,22.5,19.5,{"$f":"IF(BP5=\"\",\"\",BP5/3)","v":7.5},{"$f":"IF(BQ5=\"\",\"\",BQ5/3)","v":6.5}]
[null,null,2,null,null,null,null,null,190,{"$f":"IF(I6=\"\",\"\",IF(ISTEXT(I6),I6,IF(I6<=Basis!$M$8,\"Uit\",(100-(I6/Basis!$L$8*100))*Basis!$Y$6)))","v":36.666666666666671},0,0,0,4,58,{"$f":"IF(N6=\"\",\"\",IF(N6*60+O6>Basis!$U$8,\"Uit\",BL6+BM6))","v":31.200000000000003},null,67.866666666666674,{"$f":"IF(BP6=\"\",\"\",BR6)","v":7.5},{"$f":"IF(BQ6=\"\",\"\",BS6)","v":6.5},{"$f":"IF(R6=\"\",\"\",IF(ISTEXT(R6),R6,IF(BP6=\"\",\"\",R6-S6-T6)))","v":53.866666666666674},"",null,2,0,"-","-","-","-","-","-","-","-","-","-","-","-","-","-","-","-","-","-","-",null,null,null,null,null,0,null,null,2,null,"10:02:00","10:06:58","00:04:58",4,58,null,{"$f":"IF(K6=\"\",\"\",IF(ISTEXT(K6),K6,IF(K6>Basis!$N$8,\"Uit\",IF(ISBLANK(L6),K6,K6+L6))))","v":0},36.666666666666671,298,{"$f":"IF(N6=\"\",\"\",IF(BK6<=Basis!$F$8,0,(BK6-Basis!$F$8)*0.4))","v":31.200000000000003},{"$f":"IF(N6=\"\",\"\",IF(BK6>Basis!$G$8,0,(Basis!$G$8-BK6)*0.4))","v":0},31.200000000000003,null,22.5,19.5,7.5,6.5]
[null,null,3,null,null,null,null,null,190,{"$f":"IF(I7=\"\",\"\",IF(ISTEXT(I7),I7,IF(I7<=Basis!$M$8,\"Uit\",(100-(I7/Basis!$L$8*100))*Basis!$Y$6)))","v":36.666666666666671},0,0,0,5,0,{"$f":"IF(N7=\"\",\"\",IF(N7*60+O7>Basis!$U$8,\"Uit\",BL7+BM7))","v":32},null,68.666666666666671,7.5,6.5,{"$f":"IF(R7=\"\",\"\",IF(ISTEXT(R7),R7,IF(BP7=\"\",\"\",R7-S7-T7)))","v":54.666666666666671},"",null,3,0,"-","-","-","-","-","-","-","-","-","-","-","-","-","-","-","-","-","-","-",null,null,null,null,null,0,null,null,3,null,"10:04:00","10:09:00","00:05:00",5,0,null,{"$f":"IF(K7=\"\",\"\",IF(ISTEXT(K7),K7,IF(K7>Basis!$N$8,\"Uit\",IF(ISBLANK(L7),K7,K7+L7))))","v":0},36.666666666666671,300,{"$f":"IF(N7=\"\",\"\",IF(BK7<=Basis!$F$8,0,(BK7-Basis!$F$8)*0.4))","v":32},{"$f":"IF(N7=\"\",\"\",IF(BK7>Basis!$G$8,0,(Basis!$G$8-BK7)*0.4))","v":0},32,null,22.5,19.5,7.5,6.5]
[null,null,4,null,null,null,null,null,190,{"$f":"IF(I8=\"\",\"\",IF(ISTEXT(I8),I8,IF(I8<=Basis!$M$8,\"Uit\",(100-(I8/Basis!$L$8*100))*Basis!$Y$6)))","v":36.666666666666671},0,0,0,4,40,{"$f":"IF(N8=\"\",\"\",IF(N8*60+O8>Basis!$U$8,\"Uit\",BL8+BM8))","v":24},null,60.666666666666671,7.5,6.5,46.666666666666671,"",null,4,0,"-","-","-","-","-","-","-","-","-","-","-","-","-","-","-","-","-","-","-",null,null,null,null,null,0,null,null,4,null,"10:06:00","10:10:40","00:04:40",4,40,null,{"$f":"IF(K8=\"\",\"\",IF(ISTEXT(K8),K8,IF(K8>Basis!$N$8,\"Uit\",IF(ISBLANK(L8),K8,K8+L8))))","v":0},36.666666666666671,280,{"$f":"IF(N8=\"\",\"\",IF(BK8<=Basis!$F$8,0,(BK8-Basis!$F$8)*0.4))","v":24},{"$f":"IF(N8=\"\",\"\",IF(BK8>Basis!$G$8,0,(Basis!$G$8-BK8)*0.4))","v":0},24,null,22.5,19.5,7.5,6.5]
[null,null,5,null,null,null,null,null,190,{"$f":"IF(I9=\"\",\"\",IF(ISTEXT(I9),I9,IF(I9<=Basis!$M$8,\"Uit\",(100-(I9/Basis!$L$8*100))*Basis!$Y$6)))","v":36.666666666666671},0,0,0,4,38,{"$f":"IF(N9=\"\",\"\",IF(N9*60+O9>Basis!$U$8,\"Uit\",BL9+BM9))","v":23.200000000000003},null,59.866666666666674,7.5,6.5,45.866666666666674,"",null,5,0,"-","-","-","-","-","-","-","-","-","-","-","-","-","-","-","-","-","-","-",null,null,null,null,null,0,null,null,5,null,"10:08:00","10:12:38","00:04:38",4,38,null,{"$f":"IF(K9=\"\",\"\",IF(ISTEXT(K9),K9,IF(K9>Basis!$N$8,\"Uit\",IF(ISBLANK(L9),K9,K9+L9))))","v":0},36.666666666666671,278,{"$f":"IF(N9=\"\",\"\",IF(BK9<=Basis!$F$8,0,(BK9-Basis!$F$8)*0.4))","v":23.200000000000003},{"$f":"IF(N9=\"\",\"\",IF(BK9>Basis!$G$8,0,(Basis!$G$8-BK9)*0.4))","v":0},23.200000000000003,null,22.5,19.5,7.5,6.5]
[null,null,6,null,null,null,null,null,190,{"$f":"IF(I10=\"\",\"\",IF(ISTEXT(I10),I10,IF(I10<=Basis!$M$8,\"Uit\",(100-(I10/Basis!$L$8*100))*Basis!$Y$6)))","v":36.666666666666671},0,0,20,5,12,{"$f":"IF(N10=\"\",\"\",IF(N10*60+O10>Basis!$U$8,\"Uit\",BL10+BM10))","v":36.800000000000004},null,93.466666666666669,7.5,6.5,79.466666666666669,"",null,6,0,"-",20,"-","-","-","-","-","-","-","-","-","-","-","-","-","-","-","-","-",null,null,null,null,null,20,null,null,6,null,"10:10:00","10:15:12","00:05:12",5,12,null,{"$f":"IF(K10=\"\",\"\",IF(ISTEXT(K10),K10,IF(K10>Basis!$N$8,\"Uit\",IF(ISBLANK(L10),K10,K10+L10))))","v":0},36.666666666666671,312,{"$f":"IF(N10=\"\",\"\",IF(BK10<=Basis!$F$8,0,(BK10-Basis!$F$8)*0.4))","v":36.800000000000004},{"$f":"IF(N10=\"\",\"\",IF(BK10>Basis!$G$8,0,(Basis!$G$8-BK10)*0.4))","v":0},56.800000000000004,null,22.5,19.5,7.5,6.5]
[null,null,7,null,null,null,null,null,190,{"$f":"IF(I11=\"\",\"\",IF(ISTEXT(I11),I11,IF(I11<=Basis!$M$8,\"Uit\",(100-(I11/Basis!$L$8*100))*Basis!$Y$6)))","v":36.666666666666671},0,0,"Uit",5,12,{"$f":"IF(N11=\"\",\"\",IF(N11*60+O11>Basis!$U$8,\"Uit\",BL11+BM11))","v":36.800000000000004},null,"Uit",5,5,"Uit","4W",null,7,0,"-","-",20,60,20,"-","-","-","-","-","-","-","-","-","-","-","-","-","-",null,null,null,null,null,"Uit","4W",null,7,null,"10:12:00","10:17:12","00:05:12",5,12,null,{"$f":"IF(K11=\"\",\"\",IF(ISTEXT(K11),K11,IF(K11>Basis!$N$8,\"Uit\",IF(ISBLANK(L11),K11,K11+L11))))","v":0},36.666666666666671,312,{"$f":"IF(N11=\"\",\"\",IF(BK11<=Basis!$F$8,0,(BK11-Basis!$F$8)*0.4))","v":36.800000000000004},{"$f":"IF(N11=\"\",\"\",IF(BK11>Basis!$G$8,0,(Basis!$G$8-BK11)*0.4))","v":0},"Uit",null,15,15,5,5]
[null,null,8,null,null,null,null,null,190,{"$f":"IF(I12=\"\",\"\",IF(ISTEXT(I12),I12,IF(I12<=Basis!$M$8,\"Uit\",(100-(I12/Basis!$L$8*100))*Basis!$Y$6)))","v":36.666666666666671},null,null,"","","",{"$f":"IF(N12=\"\",\"\",IF(N12*60+O12>Basis!$U$8,\"Uit\",BL12+BM12))","v":""},null,36.666666666666671,"","","","",null,8,null,"-","-","-","-","-","-","-","-","-","-","-","-","-","-","-","-","-","-","-",null,null,null,null,null,{"$f":"IF(Y12=\"\",\"\",IF(ISTEXT(Y12),Y12,SUM(Y12:AW12)))","v":""},null,null,8,null,"10:14:00",null,"","","",null,{"$f":"IF(K12=\"\",\"\",IF(ISTEXT(K12),K12,IF(K12>Basis!$N$8,\"Uit\",IF(ISBLANK(L12),K12,K12+L12))))","v":""},36.666666666666671,"",{"$f":"IF(N12=\"\",\"\",IF(BK12<=Basis!$F$8,0,(BK12-Basis!$F$8)*0.4))","v":""},{"$f":"IF(N12=\"\",\"\",IF(BK12>Basis!$G$8,0,(Basis!$G$8-BK12)*0.4))","v":""},"",null,null,null,"",""]
[null,null,9,null,null,null,null,null,190,{"$f":"IF(I13=\"\",\"\",IF(ISTEXT(I13),I13,IF(I13<=Basis!$M$8,\"Uit\",(100-(I13/Basis!$L$8*100))*Basis!$Y$6)))","v":36.666666666666671},4,3,"","","",{"$f":"IF(N13=\"\",\"\",IF(N13*60+O13>Basis!$U$8,\"Uit\",BL13+BM13))","v":""},null,43.666666666666671,"","","","",null,9,null,"-","-","-","-","-","-","-","-","-","-","-","-","-","-","-","-","-","-","-",null,null,null,null,null,"",null,null,9,null,"10:16:00",null,"","","",null,{"$f":"IF(K13=\"\",\"\",IF(ISTEXT(K13),K13,IF(K13>Basis!$N$8,\"Uit\",IF(ISBLANK(L13),K13,K13+L13))))","v":7},43.666666666666671,"",{"$f":"IF(N13=\"\",\"\",IF(BK13<=Basis!$F$8,0,(BK13-Basis!$F$8)*0.4))","v":""},{"$f":"IF(N13=\"\",\"\",IF(BK13>Basis!$G$8,0,(Basis!$G$8-BK13)*0.4))","v":""},"",null,null,null,"",""]
[null,null,10,null,null,null,null,null,185,{"$f":"IF(I14=\"\",\"\",IF(ISTEXT(I14),I14,IF(I14<=Basis!$M$8,\"Uit\",(100-(I14/Basis!$L$8*100))*Basis!$Y$6)))","v":38.333333333333329},"Uit",null,"NG","","",{"$f":"IF(N14=\"\",\"\",IF(N14*60+O14>Basis!$U$8,\"Uit\",BL14+BM14))","v":""},null,"Uit","","","Uit","3W spr",null,10,"NG",null,null,null,null,null,null,null,null,null,null,null,null,null,null,null,null,null,null,null,null,null,null,null,null,"NG","3W spr",null,10,null,"10:18:00",null,"","","",null,{"$f":"IF(K14=\"\",\"\",IF(ISTEXT(K14),K14,IF(K14>Basis!$N$8,\"Uit\",IF(ISBLANK(L14),K14,K14+L14))))","v":"Uit"},"Uit","",{"$f":"IF(N14=\"\",\"\",IF(BK14<=Basis!$F$8,0,(BK14-Basis!$F$8)*0.4))","v":""},{"$f":"IF(N14=\"\",\"\",IF(BK14>Basis!$G$8,0,(Basis!$G$8-BK14)*0.4))","v":""},"NG",null,null,null,"",""]
[null,null,11,null,null,null,null,null,185,{"$f":"IF(I15=\"\",\"\",IF(ISTEXT(I15),I15,IF(I15<=Basis!$M$8,\"Uit\",(100-(I15/Basis!$L$8*100))*Basis!$Y$6)))","v":38.333333333333329},4,0,0,5,5,{"$f":"IF(N15=\"\",\"\",IF(N15*60+O15>Basis!$U$8,\"Uit\",BL15+BM15))","v":34},null,76.333333333333329,7.666666666666667,6.333333333333333,62.333333333333321,"",null,11,0,"-","-","-","-","-","-","-","-","-","-","-","-","-","-","-","-","-","-","-",null,null,null,null,null,0,null,null,11,null,"10:20:00",null,"","","",null,{"$f":"IF(K15=\"\",\"\",IF(ISTEXT(K15),K15,IF(K15>Basis!$N$8,\"Uit\",IF(ISBLANK(L15),K15,K15+L15))))","v":4},42.333333333333329,305,{"$f":"IF(N15=\"\",\"\",IF(BK15<=Basis!$F$8,0,(BK15-Basis!$F$8)*0.4))","v":34},{"$f":"IF(N15=\"\",\"\",IF(BK15>Basis!$G$8,0,(Basis!$G$8-BK15)*0.4))","v":0},34,null,23,19,7.666666666666667,6.333333333333333]
["HC",null,12,null,null,null,null,null,185,{"$f":"IF(I16=\"\",\"\",IF(ISTEXT(I16),I16,IF(I16<=Basis!$M$8,\"Uit\",(100-(I16/Basis!$L$8*100))*Basis!$Y$6)))","v":38.333333333333329},4,3,0,4,50,{"$f":"IF(N16=\"\",\"\",IF(N16*60+O16>Basis!$U$8,\"Uit\",BL16+BM16))","v":28},null,73.333333333333329,7.833333333333333,6.166666666666667,59.333333333333336,"",null,12,0,"-","-","-","-","-","-","-","-","-","-","-","-","-","-","-","-","-","-","-",null,null,null,null,null,0,null,null,12,null,"10:22:00",null,"","","",null,{"$f":"IF(K16=\"\",\"\",IF(ISTEXT(K16),K16,IF(K16>Basis!$N$8,\"Uit\",IF(ISBLANK(L16),K16,K16+L16))))","v":7},45.333333333333329,290,{"$f":"IF(N16=\"\",\"\",IF(BK16<=Basis!$F$8,0,(BK16-Basis!$F$8)*0.4))","v":28},{"$f":"IF(N16=\"\",\"\",IF(BK16>Basis!$G$8,0,(Basis!$G$8-BK16)*0.4))","v":0},28,null,23.5,18.5,7.833333333333333,6.166666666666667]
[null,null,13,null,null,null,null,null,"Uit",{"$f":"IF(I17=\"\",\"\",IF(ISTEXT(I17),I17,IF(I17<=Basis!$M$8,\"Uit\",(100-(I17/Basis!$L$8*100))*Basis!$Y$6)))","v":"Uit"},"NG",null,"NG",{"$f":"IF(ISBLANK(BD17),\"\",BF17)","v":""},{"$f":"IF(ISBLANK(BD17),\"\",BG17)","v":""},{"$f":"IF(N17=\"\",\"\",IF(N17*60+O17>Basis!$U$8,\"Uit\",BL17+BM17))","v":""},null,"Uit","","","Uit","dress",null,13,"NG",null,null,null,null,null,null,null,null,null,null,null,null,null,null,null,null,null,null,null,null,null,null,null,null,"NG","dress",null,13,null,"10:24:00",null,"","","",null,{"$f":"IF(K17=\"\",\"\",IF(ISTEXT(K17),K17,IF(K17>Basis!$N$8,\"Uit\",IF(ISBLANK(L17),K17,K17+L17))))","v":"NG"},"Uit","",{"$f":"IF(N17=\"\",\"\",IF(BK17<=Basis!$F$8,0,(BK17-Basis!$F$8)*0.4))","v":""},{"$f":"IF(N17=\"\",\"\",IF(BK17>Basis!$G$8,0,(Basis!$G$8-BK17)*0.4))","v":""},"NG",null,null,null,"",""]
[null,null,14,null,null,null,null,null,133,{"$f":"IF(I18=\"\",\"\",IF(ISTEXT(I18),I18,IF(I18<=Basis!$M$8,\"Uit\",(100-(I18/Basis!$L$8*100))*Basis!$Y$6)))","v":"Uit"},"NG",null,"NG",{"$f":"IF(ISBLANK(BD18),\"\",BF18)","v":""},{"$f":"IF(ISBLANK(BD18),\"\",BG18)","v":""},{"$f":"IF(N18=\"\",\"\",IF(N18*60+O18>Basis!$U$8,\"Uit\",BL18+BM18))","v":""},null,"Uit","","","Uit","<45% dress",null,14,"NG",null,null,null,null,null,null,null,null,null,null,null,null,null,null,null,null,null,null,null,null,null,null,null,null,"NG","<45% dress",null,14,null,"10:26:00",null,"","","",null,{"$f":"IF(K18=\"\",\"\",IF(ISTEXT(K18),K18,IF(K18>Basis!$N$8,\"Uit\",IF(ISBLANK(L18),K18,K18+L18))))","v":"NG"},"Uit","",{"$f":"IF(N18=\"\",\"\",IF(BK18<=Basis!$F$8,0,(BK18-Basis!$F$8)*0.4))","v":""},{"$f":"IF(N18=\"\",\"\",IF(BK18>Basis!$G$8,0,(Basis!$G$8-BK18)*0.4))","v":""},"NG",null,null,null,"",""]
[null,null,15,null,null,null,null,null,135,{"$f":"IF(I19=\"\",\"\",IF(ISTEXT(I19),I19,IF(I19<=Basis!$M$8,\"Uit\",(100-(I19/Basis!$L$8*100))*Basis!$Y$6)))","v":"Uit"},"NG",null,"NG",{"$f":"IF(ISBLANK(BD19),\"\",BF19)","v":""},{"$f":"IF(ISBLANK(BD19),\"\",BG19)","v":""},{"$f":"IF(N19=\"\",\"\",IF(N19*60+O19>Basis!$U$8,\"Uit\",BL19+BM19))","v":""},null,"Uit","","","Uit","45% dress",null,15,"NG",null,null,null,null,null,null,null,null,null,null,null,null,null,null,null,null,null,null,null,null,null,null,null,null,"NG","45% dress",null,15,null,"10:28:00",null,"","","",null,{"$f":"IF(K19=\"\",\"\",IF(ISTEXT(K19),K19,IF(K19>Basis!$N$8,\"Uit\",IF(ISBLANK(L19),K19,K19+L19))))","v":"NG"},"Uit","",{"$f":"IF(N19=\"\",\"\",IF(BK19<=Basis!$F$8,0,(BK19-Basis!$F$8)*0.4))","v":""},{"$f":"IF(N19=\"\",\"\",IF(BK19>Basis!$G$8,0,(Basis!$G$8-BK19)*0.4))","v":""},"NG",null,null,null,"",""]
[null,null,16,null,null,null,null,null,136,{"$f":"IF(I20=\"\",\"\",IF(ISTEXT(I20),I20,IF(I20<=Basis!$M$8,\"Uit\",(100-(I20/Basis!$L$8*100))*Basis!$Y$6)))","v":54.666666666666671},8,1,80,10,15,{"$f":"IF(N20=\"\",\"\",IF(N20*60+O20>Basis!$U$8,\"Uit\",BL20+BM20))","v":"Uit"},null,"Uit",6,6,"Uit","tijd cross",null,16,0,"-","-","-",20,"-","-","-","-","-",60,"-","-","-","-","-","-","-","-","-",null,null,null,null,null,80,"tijd cross",null,16,null,null,null,"","","",null,{"$f":"IF(K20=\"\",\"\",IF(ISTEXT(K20),K20,IF(K20>Basis!$N$8,\"Uit\",IF(ISBLANK(L20),K20,K20+L20))))","v":9},63.666666666666671,615,{"$f":"IF(N20=\"\",\"\",IF(BK20<=Basis!$F$8,0,(BK20-Basis!$F$8)*0.4))","v":158},{"$f":"IF(N20=\"\",\"\",IF(BK20>Basis!$G$8,0,(Basis!$G$8-BK20)*0.4))","v":0},"Uit",null,18,18,6,6]
[null,null,17,null,null,null,null,null,200,{"$f":"IF(I21=\"\",\"\",IF(ISTEXT(I21),I21,IF(I21<=Basis!$M$8,\"Uit\",(100-(I21/Basis!$L$8*100))*Basis!$Y$6)))","v":33.333333333333343},24,0,"NG",{"$f":"IF(ISBLANK(BD21),\"\",BF21)","v":""},{"$f":"IF(ISBLANK(BD21),\"\",BG21)","v":""},{"$f":"IF(N21=\"\",\"\",IF(N21*60+O21>Basis!$U$8,\"Uit\",BL21+BM21))","v":""},null,"Uit","","","Uit","spr",null,17,"NG",null,null,null,null,null,null,null,null,null,null,null,null,null,null,null,null,null,null,null,null,null,null,null,null,"NG","spr",null,17,null,null,null,"","","",null,{"$f":"IF(K21=\"\",\"\",IF(ISTEXT(K21),K21,IF(K21>Basis!$N$8,\"Uit\",IF(ISBLANK(L21),K21,K21+L21))))","v":"Uit"},"Uit","",{"$f":"IF(N21=\"\",\"\",IF(BK21<=Basis!$F$8,0,(BK21-Basis!$F$8)*0.4))","v":""},{"$f":"IF(N21=\"\",\"\",IF(BK21>Basis!$G$8,0,(Basis!$G$8-BK21)*0.4))","v":""},"NG",null,null,null,"",""]
[null,null,18,null,null,null,null,null,200,{"$f":"IF(I22=\"\",\"\",IF(ISTEXT(I22),I22,IF(I22<=Basis!$M$8,\"Uit\",(100-(I22/Basis!$L$8*100))*Basis!$Y$6)))","v":33.333333333333343},20,5,0,10,14,{"$f":"IF(N22=\"\",\"\",IF(N22*60+O22>Basis!$U$8,\"Uit\",BL22+BM22))","v":"Uit"},null,"Uit",6,5,"Uit","",null,18,0,"-","-","-","-","-","-","-","-","-","-","-","-","-","-","-","-","-","-","-",null,null,null,null,null,0,null,null,18,null,null,null,"","","",null,{"$f":"IF(K22=\"\",\"\",IF(ISTEXT(K22),K22,IF(K22>Basis!$N$8,\"Uit\",IF(ISBLANK(L22),K22,K22+L22))))","v":25},58.333333333333343,614,{"$f":"IF(N22=\"\",\"\",IF(BK22<=Basis!$F$8,0,(BK22-Basis!$F$8)*0.4))","v":157.60000000000002},{"$f":"IF(N22=\"\",\"\",IF(BK22>Basis!$G$8,0,(Basis!$G$8-BK22)*0.4))","v":0},"Uit",null,18,15,6,5]
[null,null,19,null,null,null,null,null,200,{"$f":"IF(I23=\"\",\"\",IF(ISTEXT(I23),I23,IF(I23<=Basis!$M$8,\"Uit\",(100-(I23/Basis!$L$8*100))*Basis!$Y$6)))","v":33.333333333333343},16,7,"Uit",{"$f":"IF(ISBLANK(BD23),\"\",BF23)","v":""},{"$f":"IF(ISBLANK(BD23),\"\",BG23)","v":""},{"$f":"IF(N23=\"\",\"\",IF(N23*60+O23>Basis!$U$8,\"Uit\",BL23+BM23))","v":""},null,"Uit","","","Uit","Vr.v h9",null,19,0,20,"-",20,"-","-","-",20,"Vr.v",null,null,null,null,null,null,null,null,null,null,null,null,null,null,null,null,"Uit","Vr.v h9",null,19,null,null,null,"","","",null,{"$f":"IF(K23=\"\",\"\",IF(ISTEXT(K23),K23,IF(K23>Basis!$N$8,\"Uit\",IF(ISBLANK(L23),K23,K23+L23))))","v":23},56.333333333333343,"",{"$f":"IF(N23=\"\",\"\",IF(BK23<=Basis!$F$8,0,(BK23-Basis!$F$8)*0.4))","v":""},{"$f":"IF(N23=\"\",\"\",IF(BK23>Basis!$G$8,0,(Basis!$G$8-BK23)*0.4))","v":""},"Uit",null,null,null,"",""]
[null,null,20,null,null,null,null,null,"NG",{"$f":"IF(I24=\"\",\"\",IF(ISTEXT(I24),I24,IF(I24<=Basis!$M$8,\"Uit\",(100-(I24/Basis!$L$8*100))*Basis!$Y$6)))","v":"NG"},null,null,"NG","","",{"$f":"IF(N24=\"\",\"\",IF(N24*60+O24>Basis!$U$8,\"Uit\",BL24+BM24))","v":""},null,"NG","","","NG","",null,20,"NG",null,null,null,null,null,null,null,null,null,null,null,null,null,null,null,null,null,null,null,null,null,null,null,null,"NG",null,null,20,null,null,null,"","","",null,{"$f":"IF(K24=\"\",\"\",IF(ISTEXT(K24),K24,IF(K24>Basis!$N$8,\"Uit\",IF(ISBLANK(L24),K24,K24+L24))))","v":""},"NG","",{"$f":"IF(N24=\"\",\"\",IF(BK24<=Basis!$F$8,0,(BK24-Basis!$F$8)*0.4))","v":""},{"$f":"IF(N24=\"\",\"\",IF(BK24>Basis!$G$8,0,(Basis!$G$8-BK24)*0.4))","v":""},"NG",null,null,null,"",""]
[null,null,21,null,null,null,null,null,185,{"$f":"IF(I25=\"\",\"\",IF(ISTEXT(I25),I25,IF(I25<=Basis!$M$8,\"Uit\",(100-(I25/Basis!$L$8*100))*Basis!$Y$6)))","v":38.333333333333329},0,0,"Uit","","",{"$f":"IF(N25=\"\",\"\",IF(N25*60+O25>Basis!$U$8,\"Uit\",BL25+BM25))","v":""},null,"Uit",6,6,"Uit","VP h12",null,21,0,"-","-","-","-","-",20,"-","-","-","-","VP",null,null,null,null,null,null,null,null,null,null,null,null,null,"Uit","VP h12",null,21,null,null,null,"","","",null,{"$f":"IF(K25=\"\",\"\",IF(ISTEXT(K25),K25,IF(K25>Basis!$N$8,\"Uit\",IF(ISBLANK(L25),K25,K25+L25))))","v":0},38.333333333333329,"",{"$f":"IF(N25=\"\",\"\",IF(BK25<=Basis!$F$8,0,(BK25-Basis!$F$8)*0.4))","v":""},{"$f":"IF(N25=\"\",\"\",IF(BK25>Basis!$G$8,0,(Basis!$G$8-BK25)*0.4))","v":""},"Uit",null,18,18,6,6]
[null,null,22,null,null,null,null,null,185,{"$f":"IF(I26=\"\",\"\",IF(ISTEXT(I26),I26,IF(I26<=Basis!$M$8,\"Uit\",(100-(I26/Basis!$L$8*100))*Basis!$Y$6)))","v":38.333333333333329},8,2,"Uit",5,25,{"$f":"IF(N26=\"\",\"\",IF(N26*60+O26>Basis!$U$8,\"Uit\",BL26+BM26))","v":42},null,"Uit",6.5,6,"Uit","vet cross",null,22,0,"-","-",20,"-","-","-","-",20,"-","-","-","-","-",20,"-","-","-","-","-",null,null,null,null,null,"Uit","vet cross",null,22,null,null,null,"","","",null,{"$f":"IF(K26=\"\",\"\",IF(ISTEXT(K26),K26,IF(K26>Basis!$N$8,\"Uit\",IF(ISBLANK(L26),K26,K26+L26))))","v":10},48.333333333333329,325,{"$f":"IF(N26=\"\",\"\",IF(BK26<=Basis!$F$8,0,(BK26-Basis!$F$8)*0.4))","v":42},{"$f":"IF(N26=\"\",\"\",IF(BK26>Basis!$G$8,0,(Basis!$G$8-BK26)*0.4))","v":0},"Uit",null,19.5,18,6.5,6]
[null,null,23,null,null,null,null,null,185,{"$f":"IF(I27=\"\",\"\",IF(ISTEXT(I27),I27,IF(I27<=Basis!$M$8,\"Uit\",(100-(I27/Basis!$L$8*100))*Basis!$Y$6)))","v":38.333333333333329},"Uit",null,"NG","","",{"$f":"IF(N27=\"\",\"\",IF(N27*60+O27>Basis!$U$8,\"Uit\",BL27+BM27))","v":""},null,"Uit","","","Uit","VR spr",null,23,"NG",null,null,null,null,null,null,null,null,null,null,null,null,null,null,null,null,null,null,null,null,null,null,null,null,"NG","VR spr",null,23,null,null,null,"","","",null,{"$f":"IF(K27=\"\",\"\",IF(ISTEXT(K27),K27,IF(K27>Basis!$N$8,\"Uit\",IF(ISBLANK(L27),K27,K27+L27))))","v":"Uit"},"Uit","",{"$f":"IF(N27=\"\",\"\",IF(BK27<=Basis!$F$8,0,(BK27-Basis!$F$8)*0.4))","v":""},{"$f":"IF(N27=\"\",\"\",IF(BK27>Basis!$G$8,0,(Basis!$G$8-BK27)*0.4))","v":""},"NG",null,null,null,"",""]
[null,null,24,null,null,null,null,null,185,{"$f":"IF(I28=\"\",\"\",IF(ISTEXT(I28),I28,IF(I28<=Basis!$M$8,\"Uit\",(100-(I28/Basis!$L$8*100))*Basis!$Y$6)))","v":38.333333333333329},4,0,"Uit",5,15,{"$f":"IF(N28=\"\",\"\",IF(N28*60+O28>Basis!$U$8,\"Uit\",BL28+BM28))","v":38},null,"Uit",7,6.5,"Uit","FP h19",null,24,0,"-","-","-","-",20,"-","-","-","-","-","-","-","-","-","-","-","-","FP","-",null,null,null,null,null,"Uit","FP h19",null,24,null,null,null,"","","",null,{"$f":"IF(K28=\"\",\"\",IF(ISTEXT(K28),K28,IF(K28>Basis!$N$8,\"Uit\",IF(ISBLANK(L28),K28,K28+L28))))","v":4},42.333333333333329,315,{"$f":"IF(N28=\"\",\"\",IF(BK28<=Basis!$F$8,0,(BK28-Basis!$F$8)*0.4))","v":38},{"$f":"IF(N28=\"\",\"\",IF(BK28>Basis!$G$8,0,(Basis!$G$8-BK28)*0.4))","v":0},"Uit",null,21,19.5,7,6.5]
[null,null,null,null,null,null,null,null,null,{"$f":"IF(I29=\"\",\"\",IF(ISTEXT(I29),I29,IF(I29<=Basis!$M$8,\"Uit\",(100-(I29/Basis!$L$8*100))*Basis!$Y$6)))","v":""},null,null,"","","",{"$f":"IF(N29=\"\",\"\",IF(N29*60+O29>Basis!$U$8,\"Uit\",BL29+BM29))","v":""},null,"","","","","",null,"",null,null,null,null,null,null,null,null,null,null,null,null,null,null,null,null,null,null,null,null,null,null,null,null,null,{"$f":"IF(Y29=\"\",\"\",IF(ISTEXT(Y29),Y29,SUM(Y29:AW29)))","v":""},null,null,"",null,null,null,"","","",null,{"$f":"IF(K29=\"\",\"\",IF(ISTEXT(K29),K29,IF(K29>Basis!$N$8,\"Uit\",IF(ISBLANK(L29),K29,K29+L29))))","v":""},"","",{"$f":"IF(N29=\"\",\"\",IF(BK29<=Basis!$F$8,0,(BK29-Basis!$F$8)*0.4))","v":""},{"$f":"IF(N29=\"\",\"\",IF(BK29>Basis!$G$8,0,(Basis!$G$8-BK29)*0.4))","v":""},"",null,null,null,"",""]
["  Bij uitsluiting reden vermelden : ",null,null,null,null,null,null,null,null,null,null,null,null,null,null,{"$f":"NOW()","v":"2018-06-30T22:02:24.880"},null,null,null,null,null,null,null,{"$f":"A30","v":"  Bij uitsluiting reden vermelden : "},null,null,null,null,null,null,null,null,null,null,null,null,null,null,null,null,null,null,null,null,null,null,{"$f":"NOW()","v":"2018-06-30T22:02:24.880"}]
["  VP=val paard, VR=val ruiter, 3W=3 weigeringen op zelfde hindernis, 4W=4 weigeringen totaal, FP=foutief parcours, Vr.v= vrijwillig verlaten",null,null,null,null,null,null,null,null,null,null,null,null,null,null,null,null,null,null,null,null,null,null,{"$f":"A31","v":"  VP=val paard, VR=val ruiter, 3W=3 weigeringen op zelfde hindernis, 4W=4 weigeringen totaal, FP=foutief parcours, Vr.v= vrijwillig verlaten"}]

{"sheet":"Pa-zonder","index":4,"n_rows":42,"n_cols":71,"rows_kept":42,"cut":false,"hidden":false,"merged":[[2,13,2,14],[40,15,40,21],[40,46,40,52]]}
[{"$f":"\" Samengestelde wedstrijd \"&Basis!D5","v":" Samengestelde wedstrijd Eventing Leende 30 juni 2018"},null,null,null,null,null,"Klasse B zonder dr.",null,null,null,"Dressuurjury : ",null,null,null,null,null,null,null,null,null,null,null,null," Verzamelstaat hindernisfouten in de cross",null,null,null,null,null,null,null,null,null,null,null,null,{"$f":"A1","v":" Samengestelde wedstrijd Eventing Leende 30 juni 2018"},null,null,null,null,null,null,null,null,null,null,null,null,null,null,null,{"$f":"G1&\" \"","v":"Klasse B zonder dr. "},null," Indien aankomstUUR cross wordt meegedeeld :",null,null,null,null,null," Hulpkolommen",null,null,null,null,null,null," Stijlcijfers :"]
["rank",null,"rugnr","combinatie nr","naam ruiter","naam paard","vereniging / plaats",null,"dressuur","dressuur","hind.ft.","tijd.ft.","hind.ft.","min","sec","tijd.ft.",null,"totaal","(1) stijl","(2) stijl","eind-","reden",null,null,"hindernisnummer",null,null,null,null,null,null,null,null,null,null,null,null,null,null,null,null,null,null,null,null,null,null,null,null,null," ",null,null,null,null,null,null,null,null,null,"Uitslag","NA","tijd (sec)","tijd.ft.","reg.ft.","totaal",null,"Totaal","Totaal","Gemiddelde","Gemiddelde"]
["HC",null,null,null,null,null,null,null,"totaal","strafpntn.","springen","springen","cross","cross",null,{"$f":"Basis!$H$8&\":\"&TEXT(Basis!$I$8,\"00\")","v":"3:40"},null,null,"cijfer","cijfer","totaal","uitsluiting",null,"nr",1,2,3,4,5,6,7,8,"VD",9,"VD",10,11,12,"13ab",14,15,"F",null,null,null,null,null,null,null,"totaal","reden uitsluiting","hind.","nr",null,"Vertrekuur","Aankomst","Tijd","Minuten","Seconden",null,"Springen","Springen","cross","opt.tijd =",{"$f":"Basis!$H$8&\":\"&TEXT(Basis!$I$8,\"00\")","v":"3:40"},"cross",null,"Jury 1","Jury 2","Jury 1","Jury 2"]
[null,null,null,null,null,null,null,null,null,null,null,null,null,null,null,null,null,{"$f":"IF(ISBLANK(I4),\"\",IF(AND(ISBLANK(K4),ISBLANK(Y4)),J4,IF(ISTEXT(K4),K4,IF(OR(ISBLANK(M4),M4=\"\"),J4+K4+L4,IF(ISTEXT(M4),M4,IF(ISBLANK(Y4),J4+K4+L4,J4+K4+L4+M4+P4+Q4))))))","v":""}]
[1,null,26,"704247EG","Majoor Bart Jan Geers","Ekato","RV. Militaire Ruitersportvereniging 'Te Paard!' *",null,150,{"$f":"IF(I5=\"\",\"\",IF(ISTEXT(I5),I5,IF(I5<=Basis!$M$8,\"Uit\",(100-(I5/Basis!$L$8*100))*Basis!$Y$6)))","v":50},0,0,{"$f":"IF(AX5=\"\",\"\",AX5)","v":0},{"$f":"IF(ISBLANK(BD5),\"\",BF5)","v":3},{"$f":"IF(ISBLANK(BD5),\"\",BG5)","v":34},{"$f":"IF(N5=\"\",\"\",IF(N5*60+O5>Basis!$U$8,\"Uit\",BL5+BM5))","v":0},null,{"$f":"IF(ISTEXT(BJ5),BJ5,IF(OR(ISBLANK(M5),M5=\"\",ISBLANK(Y5)),BJ5,IF(ISTEXT(BN5),BN5,BJ5+BN5)))","v":50},{"$f":"IF(BP5=\"\",\"\",BR5)","v":6.5},{"$f":"IF(BQ5=\"\",\"\",BS5)","v":6.5},{"$f":"IF(R5=\"\",\"\",IF(ISTEXT(R5),R5,IF(BP5=\"\",\"\",R5-S5-T5)))","v":37},{"$f":"IF(AY5=\"\",\"\",AY5)","v":""},null,{"$f":"IF($C5=\"\",\"\",$C5)","v":26},0,"-","-","-","-","-","-","-","-","-","-","-","-","-","-","-","-","-",null,null,null,null,null,null,null,{"$f":"IF(Y5=\"\",\"\",IF(ISTEXT(Y5),Y5,SUM(Y5:AW5)))","v":0},null,null,{"$f":"IF($C5=\"\",\"\",$C5)","v":26},null,"10:00:00","10:03:34",{"$f":"IF(ISBLANK(BD5),\"\",BD5-BC5)","v":"00:03:34"},{"$f":"IF(ISBLANK(BD5),\"\",MINUTE(BE5))","v":3},{"$f":"IF(ISBLANK(BD5),\"\",SECOND(BE5))","v":34},null,{"$f":"IF(K5=\"\",\"\",IF(ISTEXT(K5),K5,IF(K5>Basis!$N$8,\"Uit\",IF(ISBLANK(L5),K5,K5+L5))))","v":0},{"$f":"IF(OR(ISTEXT(J5),BI5=\"\"),J5,IF(ISTEXT(BI5),BI5,J5+BI5))","v":50},{"$f":"IF(N5=\"\",\"\",N5*60+O5)","v":214},{"$f":"IF(N5=\"\",\"\",IF(BK5<=Basis!$F$8,0,(BK5-Basis!$F$8)*0.4))","v":0},{"$f":"IF(N5=\"\",\"\",IF(BK5>Basis!$G$8,0,(Basis!$G$8-BK5)*0.4))","v":0},{"$f":"IF(M5=\"\",\"\",IF(ISTEXT(M5),M5,IF(ISTEXT(P5),P5,M5+P5)))","v":0},null,19.5,19.5,{"$f":"IF(BP5=\"\",\"\",BP5/3)","v":6.5},{"$f":"IF(BQ5=\"\",\"\",BQ5/3)","v":6.5}]
[2,null,12,"656057CB","Ester Beumker","Cascade","RV. Vereniging Eindhovense Manege",null,150,{"$f":"IF(I6=\"\",\"\",IF(ISTEXT(I6),I6,IF(I6<=Basis!$M$8,\"Uit\",(100-(I6/Basis!$L$8*100))*Basis!$Y$6)))","v":50},0,0,0,4,10,{"$f":"IF(N6=\"\",\"\",IF(N6*60+O6>Basis!$U$8,\"Uit\",BL6+BM6))","v":12},null,62,7.5,7,47.5,"",null,12,0,"-","-","-","-","-","-","-","-","-","-","-","-","-","-","-","-","-",null,null,null,null,null,null,null,0,null,null,12,null,"09:32:00","09:36:10","00:04:10",4,10,null,{"$f":"IF(K6=\"\",\"\",IF(ISTEXT(K6),K6,IF(K6>Basis!$N$8,\"Uit\",IF(ISBLANK(L6),K6,K6+L6))))","v":0},50,250,{"$f":"IF(N6=\"\",\"\",IF(BK6<=Basis!$F$8,0,(BK6-Basis!$F$8)*0.4))","v":12},{"$f":"IF(N6=\"\",\"\",IF(BK6>Basis!$G$8,0,(Basis!$G$8-BK6)*0.4))","v":0},12,null,22.5,21,7.5,7]
[3,null,16,"765929WC","Sanne Cornelisse","Whispering Shadow","RV. Bergakkerruiters",null,150,{"$f":"IF(I7=\"\",\"\",IF(ISTEXT(I7),I7,IF(I7<=Basis!$M$8,\"Uit\",(100-(I7/Basis!$L$8*100))*Basis!$Y$6)))","v":50},0,0,0,4,15,{"$f":"IF(N7=\"\",\"\",IF(N7*60+O7>Basis!$U$8,\"Uit\",BL7+BM7))","v":14},null,64,7.833333333333333,7.333333333333333,48.833333333333329,"",null,16,0,"-","-","-","-","-","-","-","-","-","-","-","-","-","-","-","-","-",null,null,null,null,null,null,null,0,null,null,16,null,"09:40:00","09:44:15","00:04:15",4,15,null,{"$f":"IF(K7=\"\",\"\",IF(ISTEXT(K7),K7,IF(K7>Basis!$N$8,\"Uit\",IF(ISBLANK(L7),K7,K7+L7))))","v":0},50,255,{"$f":"IF(N7=\"\",\"\",IF(BK7<=Basis!$F$8,0,(BK7-Basis!$F$8)*0.4))","v":14},{"$f":"IF(N7=\"\",\"\",IF(BK7>Basis!$G$8,0,(Basis!$G$8-BK7)*0.4))","v":0},14,null,23.5,22,7.833333333333333,7.333333333333333]
[4,null,37,"854927HB","Willem Broekman","Hero","RV. de Voornruiters",null,150,{"$f":"IF(I8=\"\",\"\",IF(ISTEXT(I8),I8,IF(I8<=Basis!$M$8,\"Uit\",(100-(I8/Basis!$L$8*100))*Basis!$Y$6)))","v":50},0,0,0,4,15,{"$f":"IF(N8=\"\",\"\",IF(N8*60+O8>Basis!$U$8,\"Uit\",BL8+BM8))","v":14},null,64,7.833333333333333,7.166666666666667,49,"",null,37,0,"-","-","-","-","-","-","-","-","-","-","-","-","-","-","-","-","-",null,null,null,null,null,null,null,0,null,null,37,null,"10:22:00","10:26:15","00:04:15",4,15,null,{"$f":"IF(K8=\"\",\"\",IF(ISTEXT(K8),K8,IF(K8>Basis!$N$8,\"Uit\",IF(ISBLANK(L8),K8,K8+L8))))","v":0},50,255,{"$f":"IF(N8=\"\",\"\",IF(BK8<=Basis!$F$8,0,(BK8-Basis!$F$8)*0.4))","v":14},{"$f":"IF(N8=\"\",\"\",IF(BK8>Basis!$G$8,0,(Basis!$G$8-BK8)*0.4))","v":0},14,null,23.5,21.5,7.833333333333333,7.166666666666667]
[5,null,20,"728920GH","Bianca Hol","Gendt","RV. de Waalruiters",null,150,{"$f":"IF(I9=\"\",\"\",IF(ISTEXT(I9),I9,IF(I9<=Basis!$M$8,\"Uit\",(100-(I9/Basis!$L$8*100))*Basis!$Y$6)))","v":50},0,0,0,4,18,{"$f":"IF(N9=\"\",\"\",IF(N9*60+O9>Basis!$U$8,\"Uit\",BL9+BM9))","v":15.200000000000001},null,65.2,7.833333333333333,6.166666666666667,51.2,"",null,20,0,"-","-","-","-","-","-","-","-","-","-","-","-","-","-","-","-","-",null,null,null,null,null,null,null,0,null,null,20,null,"09:48:00","09:52:18","00:04:18",4,18,null,{"$f":"IF(K9=\"\",\"\",IF(ISTEXT(K9),K9,IF(K9>Basis!$N$8,\"Uit\",IF(ISBLANK(L9),K9,K9+L9))))","v":0},50,258,{"$f":"IF(N9=\"\",\"\",IF(BK9<=Basis!$F$8,0,(BK9-Basis!$F$8)*0.4))","v":15.200000000000001},{"$f":"IF(N9=\"\",\"\",IF(BK9>Basis!$G$8,0,(Basis!$G$8-BK9)*0.4))","v":0},15.200000000000001,null,23.5,18.5,7.833333333333333,6.166666666666667]
[6,null,4,"840985CB","Willem Broekman","Coltin Z","RV. de Voornruiters",null,150,{"$f":"IF(I10=\"\",\"\",IF(ISTEXT(I10),I10,IF(I10<=Basis!$M$8,\"Uit\",(100-(I10/Basis!$L$8*100))*Basis!$Y$6)))","v":50},0,0,0,4,26,{"$f":"IF(N10=\"\",\"\",IF(N10*60+O10>Basis!$U$8,\"Uit\",BL10+BM10))","v":18.400000000000002},null,68.400000000000006,7.666666666666667,7.166666666666667,53.566666666666677,"",null,4,0,"-","-","-","-","-","-","-","-","-","-","-","-","-","-","-","-","-",null,null,null,null,null,null,null,0,null,null,4,null,"09:16:00","09:20:26","00:04:26",4,26,null,{"$f":"IF(K10=\"\",\"\",IF(ISTEXT(K10),K10,IF(K10>Basis!$N$8,\"Uit\",IF(ISBLANK(L10),K10,K10+L10))))","v":0},50,266,{"$f":"IF(N10=\"\",\"\",IF(BK10<=Basis!$F$8,0,(BK10-Basis!$F$8)*0.4))","v":18.400000000000002},{"$f":"IF(N10=\"\",\"\",IF(BK10>Basis!$G$8,0,(Basis!$G$8-BK10)*0.4))","v":0},18.400000000000002,null,23,21.5,7.666666666666667,7.166666666666667]
[7,null,19,"775085GW","Karin Wassink","Gio","RV. Hummelo",null,150,{"$f":"IF(I11=\"\",\"\",IF(ISTEXT(I11),I11,IF(I11<=Basis!$M$8,\"Uit\",(100-(I11/Basis!$L$8*100))*Basis!$Y$6)))","v":50},4,0,0,4,13,{"$f":"IF(N11=\"\",\"\",IF(N11*60+O11>Basis!$U$8,\"Uit\",BL11+BM11))","v":13.200000000000001},null,67.2,6,6.833333333333333,54.366666666666667,"",null,19,0,"-","-","-","-","-","-","-","-","-","-","-","-","-","-","-","-","-",null,null,null,null,null,null,null,0,null,null,19,null,"09:46:00","09:50:13","00:04:13",4,13,null,{"$f":"IF(K11=\"\",\"\",IF(ISTEXT(K11),K11,IF(K11>Basis!$N$8,\"Uit\",IF(ISBLANK(L11),K11,K11+L11))))","v":4},54,253,{"$f":"IF(N11=\"\",\"\",IF(BK11<=Basis!$F$8,0,(BK11-Basis!$F$8)*0.4))","v":13.200000000000001},{"$f":"IF(N11=\"\",\"\",IF(BK11>Basis!$G$8,0,(Basis!$G$8-BK11)*0.4))","v":0},13.200000000000001,null,18,20.5,6,6.833333333333333]
[8,null,59,"756598NH","Senna van Houten","Vagante",null,null,150,{"$f":"IF(I12=\"\",\"\",IF(ISTEXT(I12),I12,IF(I12<=Basis!$M$8,\"Uit\",(100-(I12/Basis!$L$8*100))*Basis!$Y$6)))","v":50},0,0,0,4,31,{"$f":"IF(N12=\"\",\"\",IF(N12*60+O12>Basis!$U$8,\"Uit\",BL12+BM12))","v":20.400000000000002},null,70.400000000000006,8.6666666666666661,6.666666666666667,55.066666666666677,"",null,59,0,"-","-","-","-","-","-","-","-","-","-","-","-","-","-","-","-","-",null,null,null,null,null,null,null,0,null,null,59,null,"11:06:00","11:10:31","00:04:31",4,31,null,{"$f":"IF(K12=\"\",\"\",IF(ISTEXT(K12),K12,IF(K12>Basis!$N$8,\"Uit\",IF(ISBLANK(L12),K12,K12+L12))))","v":0},50,271,{"$f":"IF(N12=\"\",\"\",IF(BK12<=Basis!$F$8,0,(BK12-Basis!$F$8)*0.4))","v":20.400000000000002},{"$f":"IF(N12=\"\",\"\",IF(BK12>Basis!$G$8,0,(Basis!$G$8-BK12)*0.4))","v":0},20.400000000000002,null,26,20,8.6666666666666661,6.666666666666667]
[9,null,25,"Belgie","Kyara Langendries","Viya Cobronc'sz",null,null,150,{"$f":"IF(I13=\"\",\"\",IF(ISTEXT(I13),I13,IF(I13<=Basis!$M$8,\"Uit\",(100-(I13/Basis!$L$8*100))*Basis!$Y$6)))","v":50},8,0,0,4,18,{"$f":"IF(N13=\"\",\"\",IF(N13*60+O13>Basis!$U$8,\"Uit\",BL13+BM13))","v":15.200000000000001},null,73.2,7.666666666666667,9.5,56.033333333333331,"",null,25,0,"-","-","-","-","-","-","-","-","-","-","-","-","-","-","-","-","-",null,null,null,null,null,null,null,0,null,null,25,null,"09:58:00","10:02:18","00:04:18",4,18,null,{"$f":"IF(K13=\"\",\"\",IF(ISTEXT(K13),K13,IF(K13>Basis!$N$8,\"Uit\",IF(ISBLANK(L13),K13,K13+L13))))","v":8},58,258,{"$f":"IF(N13=\"\",\"\",IF(BK13<=Basis!$F$8,0,(BK13-Basis!$F$8)*0.4))","v":15.200000000000001},{"$f":"IF(N13=\"\",\"\",IF(BK13>Basis!$G$8,0,(Basis!$G$8-BK13)*0.4))","v":0},15.200000000000001,null,23,28.5,7.666666666666667,9.5]
[10,null,6,"823906QK","Belinda Knoops","Quite Catrick","De Boschhoeve",null,150,{"$f":"IF(I14=\"\",\"\",IF(ISTEXT(I14),I14,IF(I14<=Basis!$M$8,\"Uit\",(100-(I14/Basis!$L$8*100))*Basis!$Y$6)))","v":50},0,0,0,4,35,{"$f":"IF(N14=\"\",\"\",IF(N14*60+O14>Basis!$U$8,\"Uit\",BL14+BM14))","v":22},null,72,8.1666666666666661,6.166666666666667,57.666666666666671,"",null,6,0,"-","-","-","-","-","-","-","-","-","-","-","-","-","-","-","-","-",null,null,null,null,null,null,null,0,null,null,6,null,"09:20:00","09:24:35","00:04:35",4,35,null,{"$f":"IF(K14=\"\",\"\",IF(ISTEXT(K14),K14,IF(K14>Basis!$N$8,\"Uit\",IF(ISBLANK(L14),K14,K14+L14))))","v":0},50,275,{"$f":"IF(N14=\"\",\"\",IF(BK14<=Basis!$F$8,0,(BK14-Basis!$F$8)*0.4))","v":22},{"$f":"IF(N14=\"\",\"\",IF(BK14>Basis!$G$8,0,(Basis!$G$8-BK14)*0.4))","v":0},22,null,24.5,18.5,8.1666666666666661,6.166666666666667]
[11,null,23,"854925IW","Henk Wieberdink","Indine","RV. Stroe",null,150,{"$f":"IF(I15=\"\",\"\",IF(ISTEXT(I15),I15,IF(I15<=Basis!$M$8,\"Uit\",(100-(I15/Basis!$L$8*100))*Basis!$Y$6)))","v":50},4,0,0,4,31,{"$f":"IF(N15=\"\",\"\",IF(N15*60+O15>Basis!$U$8,\"Uit\",BL15+BM15))","v":20.400000000000002},null,74.400000000000006,8,7.166666666666667,59.233333333333341,"",null,23,0,"-","-","-","-","-","-","-","-","-","-","-","-","-","-","-","-","-",null,null,null,null,null,null,null,0,null,null,23,null,"10:04:00","10:08:31","00:04:31",4,31,null,{"$f":"IF(K15=\"\",\"\",IF(ISTEXT(K15),K15,IF(K15>Basis!$N$8,\"Uit\",IF(ISBLANK(L15),K15,K15+L15))))","v":4},54,271,{"$f":"IF(N15=\"\",\"\",IF(BK15<=Basis!$F$8,0,(BK15-Basis!$F$8)*0.4))","v":20.400000000000002},{"$f":"IF(N15=\"\",\"\",IF(BK15>Basis!$G$8,0,(Basis!$G$8-BK15)*0.4))","v":0},20.400000000000002,null,24,21.5,8,7.166666666666667]
[12,null,1,"845469IW","Henk Wieberdink","Immontane OMHG","RV. Stroe",null,150,{"$f":"IF(I16=\"\",\"\",IF(ISTEXT(I16),I16,IF(I16<=Basis!$M$8,\"Uit\",(100-(I16/Basis!$L$8*100))*Basis!$Y$6)))","v":50},8,0,0,4,21,{"$f":"IF(N16=\"\",\"\",IF(N16*60+O16>Basis!$U$8,\"Uit\",BL16+BM16))","v":16.400000000000002},null,74.400000000000006,6.5,6.166666666666667,61.733333333333341,"",null,1,0,"-","-","-","-","-","-","-","-","-","-","-","-","-","-","-","-","-",null,null,null,null,null,null,null,0,null,null,1,null,"09:10:00","09:14:21","00:04:21",4,21,null,{"$f":"IF(K16=\"\",\"\",IF(ISTEXT(K16),K16,IF(K16>Basis!$N$8,\"Uit\",IF(ISBLANK(L16),K16,K16+L16))))","v":8},58,261,{"$f":"IF(N16=\"\",\"\",IF(BK16<=Basis!$F$8,0,(BK16-Basis!$F$8)*0.4))","v":16.400000000000002},{"$f":"IF(N16=\"\",\"\",IF(BK16>Basis!$G$8,0,(Basis!$G$8-BK16)*0.4))","v":0},16.400000000000002,null,19.5,18.5,6.5,6.166666666666667]
[13,null,52,"842701CK ","Renske Kroeze","Can Fly","RV. Leijeruiters Helvoirt (pv)",null,150,{"$f":"IF(I17=\"\",\"\",IF(ISTEXT(I17),I17,IF(I17<=Basis!$M$8,\"Uit\",(100-(I17/Basis!$L$8*100))*Basis!$Y$6)))","v":50},4,0,0,4,40,{"$f":"IF(N17=\"\",\"\",IF(N17*60+O17>Basis!$U$8,\"Uit\",BL17+BM17))","v":24},null,78,8.8333333333333339,7.333333333333333,61.833333333333336,"",null,52,0,"-","-","-","-","-","-","-","-","-","-","-","-","-","-","-","-","-",null,null,null,null,null,null,null,0,null,null,52,null,"10:52:00","10:56:40","00:04:40",4,40,null,{"$f":"IF(K17=\"\",\"\",IF(ISTEXT(K17),K17,IF(K17>Basis!$N$8,\"Uit\",IF(ISBLANK(L17),K17,K17+L17))))","v":4},54,280,{"$f":"IF(N17=\"\",\"\",IF(BK17<=Basis!$F$8,0,(BK17-Basis!$F$8)*0.4))","v":24},{"$f":"IF(N17=\"\",\"\",IF(BK17>Basis!$G$8,0,(Basis!$G$8-BK17)*0.4))","v":0},24,null,26.5,22,8.8333333333333339,7.333333333333333]
[14,null,27,"744335ME","Vincent Erkamp","Bellissimo S","Manege De Hoef V.O.F.",null,150,{"$f":"IF(I18=\"\",\"\",IF(ISTEXT(I18),I18,IF(I18<=Basis!$M$8,\"Uit\",(100-(I18/Basis!$L$8*100))*Basis!$Y$6)))","v":50},4,0,0,5,7,{"$f":"IF(N18=\"\",\"\",IF(N18*60+O18>Basis!$U$8,\"Uit\",BL18+BM18))","v":34.800000000000004},null,88.800000000000011,8,7,73.800000000000011,"",null,27,0,"-","-","-","-","-","-","-","-","-","-","-","-","-","-","-","-","-",null,null,null,null,null,null,null,0,null,null,27,null,"10:02:00","10:07:07","00:05:07",5,7,null,{"$f":"IF(K18=\"\",\"\",IF(ISTEXT(K18),K18,IF(K18>Basis!$N$8,\"Uit\",IF(ISBLANK(L18),K18,K18+L18))))","v":4},54,307,{"$f":"IF(N18=\"\",\"\",IF(BK18<=Basis!$F$8,0,(BK18-Basis!$F$8)*0.4))","v":34.800000000000004},{"$f":"IF(N18=\"\",\"\",IF(BK18>Basis!$G$8,0,(Basis!$G$8-BK18)*0.4))","v":0},34.800000000000004,null,24,21,8,7]
[15,null,7,"822016AP","Natasja van de Pavert","Allure E","RV. de Peelse Vrije Teugels",null,150,{"$f":"IF(I19=\"\",\"\",IF(ISTEXT(I19),I19,IF(I19<=Basis!$M$8,\"Uit\",(100-(I19/Basis!$L$8*100))*Basis!$Y$6)))","v":50},0,0,20,4,38,{"$f":"IF(N19=\"\",\"\",IF(N19*60+O19>Basis!$U$8,\"Uit\",BL19+BM19))","v":23.200000000000003},null,93.2,6.833333333333333,6.333333333333333,80.033333333333346,"",null,7,0,"-","-","-","-","-","-","-","-","-","-","-","-",20,"-","-","-","-",null,null,null,null,null,null,null,20,null,null,7,null,"09:22:00","09:26:38","00:04:38",4,38,null,{"$f":"IF(K19=\"\",\"\",IF(ISTEXT(K19),K19,IF(K19>Basis!$N$8,\"Uit\",IF(ISBLANK(L19),K19,K19+L19))))","v":0},50,278,{"$f":"IF(N19=\"\",\"\",IF(BK19<=Basis!$F$8,0,(BK19-Basis!$F$8)*0.4))","v":23.200000000000003},{"$f":"IF(N19=\"\",\"\",IF(BK19>Basis!$G$8,0,(Basis!$G$8-BK19)*0.4))","v":0},43.2,null,20.5,19,6.833333333333333,6.333333333333333]
[16,null,5,"824576IB","Shannon Bakker","Ici Mabelle","Manege De Hoef V.O.F.",null,150,{"$f":"IF(I20=\"\",\"\",IF(ISTEXT(I20),I20,IF(I20<=Basis!$M$8,\"Uit\",(100-(I20/Basis!$L$8*100))*Basis!$Y$6)))","v":50},8,13,0,4,50,{"$f":"IF(N20=\"\",\"\",IF(N20*60+O20>Basis!$U$8,\"Uit\",BL20+BM20))","v":28},null,99,6,6.166666666666667,86.833333333333329,"",null,5,0,"-","-","-","-","-","-","-","-","-","-","-","-","-","-","-","-","-",null,null,null,null,null,null,null,0,null,null,5,null,"09:18:00","09:22:50","00:04:50",4,50,null,{"$f":"IF(K20=\"\",\"\",IF(ISTEXT(K20),K20,IF(K20>Basis!$N$8,\"Uit\",IF(ISBLANK(L20),K20,K20+L20))))","v":21},71,290,{"$f":"IF(N20=\"\",\"\",IF(BK20<=Basis!$F$8,0,(BK20-Basis!$F$8)*0.4))","v":28},{"$f":"IF(N20=\"\",\"\",IF(BK20>Basis!$G$8,0,(Basis!$G$8-BK20)*0.4))","v":0},28,null,18,18.5,6,6.166666666666667]
[17,null,51,"856221GV ","Rosalie Vriens","Gigi",null,null,150,{"$f":"IF(I21=\"\",\"\",IF(ISTEXT(I21),I21,IF(I21<=Basis!$M$8,\"Uit\",(100-(I21/Basis!$L$8*100))*Basis!$Y$6)))","v":50},4,0,0,5,43,{"$f":"IF(N21=\"\",\"\",IF(N21*60+O21>Basis!$U$8,\"Uit\",BL21+BM21))","v":49.2},null,103.2,8.5,7,87.7,"",null,51,0,"-","-","-","-","-","-","-","-","-","-","-","-","-","-","-","-","-",null,null,null,null,null,null,null,0,null,null,51,null,"10:50:00","10:55:43","00:05:43",5,43,null,{"$f":"IF(K21=\"\",\"\",IF(ISTEXT(K21),K21,IF(K21>Basis!$N$8,\"Uit\",IF(ISBLANK(L21),K21,K21+L21))))","v":4},54,343,{"$f":"IF(N21=\"\",\"\",IF(BK21<=Basis!$F$8,0,(BK21-Basis!$F$8)*0.4))","v":49.2},{"$f":"IF(N21=\"\",\"\",IF(BK21>Basis!$G$8,0,(Basis!$G$8-BK21)*0.4))","v":0},49.2,null,25.5,21,8.5,7]
[18,null,8,"789890AH","Rick van Hout","Affection SLZ","RV. Treekerij",null,150,{"$f":"IF(I22=\"\",\"\",IF(ISTEXT(I22),I22,IF(I22<=Basis!$M$8,\"Uit\",(100-(I22/Basis!$L$8*100))*Basis!$Y$6)))","v":50},4,0,20,4,57,{"$f":"IF(N22=\"\",\"\",IF(N22*60+O22>Basis!$U$8,\"Uit\",BL22+BM22))","v":30.8},null,104.8,5.5,6,93.3,"",null,8,0,"-","-",20,"-","-","-","-","-","-","-","-","-","-","-","-","-","-",null,null,null,null,null,null,null,20,null,null,8,null,"09:24:00","09:28:57","00:04:57",4,57,null,{"$f":"IF(K22=\"\",\"\",IF(ISTEXT(K22),K22,IF(K22>Basis!$N$8,\"Uit\",IF(ISBLANK(L22),K22,K22+L22))))","v":4},54,297,{"$f":"IF(N22=\"\",\"\",IF(BK22<=Basis!$F$8,0,(BK22-Basis!$F$8)*0.4))","v":30.8},{"$f":"IF(N22=\"\",\"\",IF(BK22>Basis!$G$8,0,(Basis!$G$8-BK22)*0.4))","v":0},50.8,null,16.5,18,5.5,6]
[19,null,3,"847198HC","Minouche Castricum","Highlander","Manege De Hoef V.O.F.",null,150,{"$f":"IF(I23=\"\",\"\",IF(ISTEXT(I23),I23,IF(I23<=Basis!$M$8,\"Uit\",(100-(I23/Basis!$L$8*100))*Basis!$Y$6)))","v":50},0,0,40,5,12,{"$f":"IF(N23=\"\",\"\",IF(N23*60+O23>Basis!$U$8,\"Uit\",BL23+BM23))","v":36.800000000000004},null,126.80000000000001,6.166666666666667,6,114.63333333333334,"",null,3,0,"-","-","-","-","-",20,"-","-","-","-","-","-","-",20,"-","-","-",null,null,null,null,null,null,null,40,null,null,3,null,"09:14:00","09:19:12","00:05:12",5,12,null,{"$f":"IF(K23=\"\",\"\",IF(ISTEXT(K23),K23,IF(K23>Basis!$N$8,\"Uit\",IF(ISBLANK(L23),K23,K23+L23))))","v":0},50,312,{"$f":"IF(N23=\"\",\"\",IF(BK23<=Basis!$F$8,0,(BK23-Basis!$F$8)*0.4))","v":36.800000000000004},{"$f":"IF(N23=\"\",\"\",IF(BK23>Basis!$G$8,0,(Basis!$G$8-BK23)*0.4))","v":0},76.800000000000011,null,18.5,18,6.166666666666667,6]
[20,null,11,"840242CL","Daphne Lenkens","Charlotte","RV. Ysselsteyn",null,150,{"$f":"IF(I24=\"\",\"\",IF(ISTEXT(I24),I24,IF(I24<=Basis!$M$8,\"Uit\",(100-(I24/Basis!$L$8*100))*Basis!$Y$6)))","v":50},0,0,60,5,54,{"$f":"IF(N24=\"\",\"\",IF(N24*60+O24>Basis!$U$8,\"Uit\",BL24+BM24))","v":53.6},null,163.6,5.5,6.5,151.6,"",null,11,0,"-","-",60,"-","-","-","-","-","-","-","-","-","-","-","-","-","-",null,null,null,null,null,null,null,60,null,null,11,null,"09:30:00","09:35:54","00:05:54",5,54,null,{"$f":"IF(K24=\"\",\"\",IF(ISTEXT(K24),K24,IF(K24>Basis!$N$8,\"Uit\",IF(ISBLANK(L24),K24,K24+L24))))","v":0},50,354,{"$f":"IF(N24=\"\",\"\",IF(BK24<=Basis!$F$8,0,(BK24-Basis!$F$8)*0.4))","v":53.6},{"$f":"IF(N24=\"\",\"\",IF(BK24>Basis!$G$8,0,(Basis!$G$8-BK24)*0.4))","v":0},113.6,null,16.5,19.5,5.5,6.5]
[21,null,10,"846971AS","Kelly Schiphorst","Angel","Manege Napoleon BV",null,150,{"$f":"IF(I25=\"\",\"\",IF(ISTEXT(I25),I25,IF(I25<=Basis!$M$8,\"Uit\",(100-(I25/Basis!$L$8*100))*Basis!$Y$6)))","v":50},0,0,100,5,23,{"$f":"IF(N25=\"\",\"\",IF(N25*60+O25>Basis!$U$8,\"Uit\",BL25+BM25))","v":41.2},null,191.2,5.166666666666667,5,181.03333333333333,"",null,10,20,"-","-",20,"-","-","-","-","-","-","-","-","-",60,"-","-","-","-",null,null,null,null,null,null,null,100,null,null,10,null,"09:28:00","09:33:23","00:05:23",5,23,null,{"$f":"IF(K25=\"\",\"\",IF(ISTEXT(K25),K25,IF(K25>Basis!$N$8,\"Uit\",IF(ISBLANK(L25),K25,K25+L25))))","v":0},50,323,{"$f":"IF(N25=\"\",\"\",IF(BK25<=Basis!$F$8,0,(BK25-Basis!$F$8)*0.4))","v":41.2},{"$f":"IF(N25=\"\",\"\",IF(BK25>Basis!$G$8,0,(Basis!$G$8-BK25)*0.4))","v":0},141.19999999999999,null,15.5,15,5.166666666666667,5]
[null,null,9,"731891DM","Patricia Meijs","Daphne","RV. Heeze (rsv.)",null,150,{"$f":"IF(I26=\"\",\"\",IF(ISTEXT(I26),I26,IF(I26<=Basis!$M$8,\"Uit\",(100-(I26/Basis!$L$8*100))*Basis!$Y$6)))","v":50},"NG",null,"NG","","",{"$f":"IF(N26=\"\",\"\",IF(N26*60+O26>Basis!$U$8,\"Uit\",BL26+BM26))","v":""},null,"NG","","","NG","",null,9,"NG",null,null,null,null,null,null,null,null,null,null,null,null,null,null,null,null,null,null,null,null,null,null,null,null,"NG",null,null,9,null,"09:26:00",null,"","","",null,{"$f":"IF(K26=\"\",\"\",IF(ISTEXT(K26),K26,IF(K26>Basis!$N$8,\"Uit\",IF(ISBLANK(L26),K26,K26+L26))))","v":"NG"},"NG","",{"$f":"IF(N26=\"\",\"\",IF(BK26<=Basis!$F$8,0,(BK26-Basis!$F$8)*0.4))","v":""},{"$f":"IF(N26=\"\",\"\",IF(BK26>Basis!$G$8,0,(Basis!$G$8-BK26)*0.4))","v":""},"NG",null,null,null,"",""]
[null,null,13,"457651CP","Anne-Marie Peters","Cartouche van het Keizerhof","RV. De Cavaliers",null,150,{"$f":"IF(I27=\"\",\"\",IF(ISTEXT(I27),I27,IF(I27<=Basis!$M$8,\"Uit\",(100-(I27/Basis!$L$8*100))*Basis!$Y$6)))","v":50},"NG",null,"NG","","",{"$f":"IF(N27=\"\",\"\",IF(N27*60+O27>Basis!$U$8,\"Uit\",BL27+BM27))","v":""},null,"NG","","","NG","",null,13,"NG",null,null,null,null,null,null,null,null,null,null,null,null,null,null,null,null,null,null,null,null,null,null,null,null,"NG",null,null,13,null,"09:34:00",null,"","","",null,{"$f":"IF(K27=\"\",\"\",IF(ISTEXT(K27),K27,IF(K27>Basis!$N$8,\"Uit\",IF(ISBLANK(L27),K27,K27+L27))))","v":"NG"},"NG","",{"$f":"IF(N27=\"\",\"\",IF(BK27<=Basis!$F$8,0,(BK27-Basis!$F$8)*0.4))","v":""},{"$f":"IF(N27=\"\",\"\",IF(BK27>Basis!$G$8,0,(Basis!$G$8-BK27)*0.4))","v":""},"NG",null,null,null,"",""]
[null,null,17,"Duitsland","Marc Schoenen","Limerix",null,null,150,{"$f":"IF(I28=\"\",\"\",IF(ISTEXT(I28),I28,IF(I28<=Basis!$M$8,\"Uit\",(100-(I28/Basis!$L$8*100))*Basis!$Y$6)))","v":50},"NG",null,"NG","","",{"$f":"IF(N28=\"\",\"\",IF(N28*60+O28>Basis!$U$8,\"Uit\",BL28+BM28))","v":""},null,"NG","","","NG","",null,17,"NG","-","-","-","-","-","-","-","-","-","-","-","-","-","-","-","-","-",null,null,null,null,null,null,null,"NG",null,null,17,null,"09:42:00",null,"","","",null,{"$f":"IF(K28=\"\",\"\",IF(ISTEXT(K28),K28,IF(K28>Basis!$N$8,\"Uit\",IF(ISBLANK(L28),K28,K28+L28))))","v":"NG"},"NG","",{"$f":"IF(N28=\"\",\"\",IF(BK28<=Basis!$F$8,0,(BK28-Basis!$F$8)*0.4))","v":""},{"$f":"IF(N28=\"\",\"\",IF(BK28>Basis!$G$8,0,(Basis!$G$8-BK28)*0.4))","v":""},"NG",null,null,null,"",""]
[null,null,15,"785183ER","Justin de Ronde","Easter Hurricane","RV. Eendracht",null,150,{"$f":"IF(I29=\"\",\"\",IF(ISTEXT(I29),I29,IF(I29<=Basis!$M$8,\"Uit\",(100-(I29/Basis!$L$8*100))*Basis!$Y$6)))","v":50},0,0,{"$f":"IF(AX29=\"\",\"\",AX29)","v":"Uit"},3,53,{"$f":"IF(N29=\"\",\"\",IF(N29*60+O29>Basis!$U$8,\"Uit\",BL29+BM29))","v":5.2},null,"Uit",8.6666666666666661,7.333333333333333,"Uit","FP h. 9 d*",null,15,0,"-","-","-","-","-","-","-","-","FP","-","-","-","-","-","-","-","-",null,null,null,null,null,null,null,"Uit","FP h. 9 d*",null,15,null,"09:38:00","09:41:53","00:03:53",3,53,null,{"$f":"IF(K29=\"\",\"\",IF(ISTEXT(K29),K29,IF(K29>Basis!$N$8,\"Uit\",IF(ISBLANK(L29),K29,K29+L29))))","v":0},50,233,{"$f":"IF(N29=\"\",\"\",IF(BK29<=Basis!$F$8,0,(BK29-Basis!$F$8)*0.4))","v":5.2},{"$f":"IF(N29=\"\",\"\",IF(BK29>Basis!$G$8,0,(Basis!$G$8-BK29)*0.4))","v":0},"Uit",null,26,22,8.6666666666666661,7.333333333333333]
[null,null,21,"Belgie","Nicole Peters","Silvana",null,null,150,{"$f":"IF(I30=\"\",\"\",IF(ISTEXT(I30),I30,IF(I30<=Basis!$M$8,\"Uit\",(100-(I30/Basis!$L$8*100))*Basis!$Y$6)))","v":50},4,1,"Uit",7,8,{"$f":"IF(N30=\"\",\"\",IF(N30*60+O30>Basis!$U$8,\"Uit\",BL30+BM30))","v":83.2},null,"Uit","",6,"Uit","FP h.12 d*",null,21,0,"-","-","-","-","-","-",20,"-",20,"-","-","-","FP","-","-","-","-",null,null,null,null,null,null,null,"Uit","FP h.12 d*",null,21,null,"09:50:00","09:57:08","00:07:08",7,8,null,{"$f":"IF(K30=\"\",\"\",IF(ISTEXT(K30),K30,IF(K30>Basis!$N$8,\"Uit\",IF(ISBLANK(L30),K30,K30+L30))))","v":5},55,428,{"$f":"IF(N30=\"\",\"\",IF(BK30<=Basis!$F$8,0,(BK30-Basis!$F$8)*0.4))","v":83.2},{"$f":"IF(N30=\"\",\"\",IF(BK30>Basis!$G$8,0,(Basis!$G$8-BK30)*0.4))","v":0},"Uit",null,null,18,"",6]
[null,null,36,"836078GC","Minouche Castricum","Mulan","Manege De Hoef V.O.F.",null,150,{"$f":"IF(I31=\"\",\"\",IF(ISTEXT(I31),I31,IF(I31<=Basis!$M$8,\"Uit\",(100-(I31/Basis!$L$8*100))*Basis!$Y$6)))","v":50},0,0,"Uit","","",{"$f":"IF(N31=\"\",\"\",IF(N31*60+O31>Basis!$U$8,\"Uit\",BL31+BM31))","v":""},null,"Uit",1,"","Uit","3W h.4",null,36,0,"-","-","3W",null,null,null,null,null,null,null,null,null,null,null,null,null,null,null,null,null,null,null,null,null,"Uit","3W h.4",null,36,null,"10:20:00",null,"","","",null,{"$f":"IF(K31=\"\",\"\",IF(ISTEXT(K31),K31,IF(K31>Basis!$N$8,\"Uit\",IF(ISBLANK(L31),K31,K31+L31))))","v":0},50,"",{"$f":"IF(N31=\"\",\"\",IF(BK31<=Basis!$F$8,0,(BK31-Basis!$F$8)*0.4))","v":""},{"$f":"IF(N31=\"\",\"\",IF(BK31>Basis!$G$8,0,(Basis!$G$8-BK31)*0.4))","v":""},"Uit",null,3,null,1,""]
["HC",null,18,"858217MK","Ilonka Kluytmans","Mister Copperfield",null,null,150,{"$f":"IF(I32=\"\",\"\",IF(ISTEXT(I32),I32,IF(I32<=Basis!$M$8,\"Uit\",(100-(I32/Basis!$L$8*100))*Basis!$Y$6)))","v":50},0,0,0,3,54,{"$f":"IF(N32=\"\",\"\",IF(N32*60+O32>Basis!$U$8,\"Uit\",BL32+BM32))","v":5.6000000000000005},null,55.6,9.5,7,39.1,"",null,18,0,"-","-","-","-","-","-","-","-","-","-","-","-","-","-","-","-","-",null,null,null,null,null,null,null,{"$f":"IF(Y32=\"\",\"\",IF(ISTEXT(Y32),Y32,SUM(Y32:AW32)))","v":0},null,null,18,null,"09:44:00","09:47:54","00:03:54",3,54,null,{"$f":"IF(K32=\"\",\"\",IF(ISTEXT(K32),K32,IF(K32>Basis!$N$8,\"Uit\",IF(ISBLANK(L32),K32,K32+L32))))","v":0},50,234,{"$f":"IF(N32=\"\",\"\",IF(BK32<=Basis!$F$8,0,(BK32-Basis!$F$8)*0.4))","v":5.6000000000000005},{"$f":"IF(N32=\"\",\"\",IF(BK32>Basis!$G$8,0,(Basis!$G$8-BK32)*0.4))","v":0},5.6000000000000005,null,28.5,21,9.5,7]
["HC",null,2,"855714IK","Renske Kroeze","Irvine","RV. Leijeruiters Helvoirt (pv)",null,150,{"$f":"IF(I33=\"\",\"\",IF(ISTEXT(I33),I33,IF(I33<=Basis!$M$8,\"Uit\",(100-(I33/Basis!$L$8*100))*Basis!$Y$6)))","v":50},0,0,0,4,38,{"$f":"IF(N33=\"\",\"\",IF(N33*60+O33>Basis!$U$8,\"Uit\",BL33+BM33))","v":23.200000000000003},null,73.2,7.166666666666667,7.166666666666667,58.866666666666667,"",null,2,0,"-","-","-","-","-","-","-","-","-","-","-","-","-","-","-","-","-",null,null,null,null,null,null,null,0,null,null,2,null,"09:12:00","09:16:38","00:04:38",4,38,null,{"$f":"IF(K33=\"\",\"\",IF(ISTEXT(K33),K33,IF(K33>Basis!$N$8,\"Uit\",IF(ISBLANK(L33),K33,K33+L33))))","v":0},50,278,{"$f":"IF(N33=\"\",\"\",IF(BK33<=Basis!$F$8,0,(BK33-Basis!$F$8)*0.4))","v":23.200000000000003},{"$f":"IF(N33=\"\",\"\",IF(BK33>Basis!$G$8,0,(Basis!$G$8-BK33)*0.4))","v":0},23.200000000000003,null,21.5,21.5,7.166666666666667,7.166666666666667]
["HC",null,22,"644343PS","Seezwaa Smit","Petillante de ceran","RV. Xanthus Spaarnwoude",null,150,{"$f":"IF(I34=\"\",\"\",IF(ISTEXT(I34),I34,IF(I34<=Basis!$M$8,\"Uit\",(100-(I34/Basis!$L$8*100))*Basis!$Y$6)))","v":50},0,0,0,4,44,{"$f":"IF(N34=\"\",\"\",IF(N34*60+O34>Basis!$U$8,\"Uit\",BL34+BM34))","v":25.6},null,75.599999999999994,8.3333333333333339,6.666666666666667,60.6,"",null,22,0,"-","-","-","-","-","-","-","-","-","-","-","-","-","-","-","-","-",null,null,null,null,null,null,null,0,null,null,22,null,"09:52:00","09:56:44","00:04:44",4,44,null,{"$f":"IF(K34=\"\",\"\",IF(ISTEXT(K34),K34,IF(K34>Basis!$N$8,\"Uit\",IF(ISBLANK(L34),K34,K34+L34))))","v":0},50,284,{"$f":"IF(N34=\"\",\"\",IF(BK34<=Basis!$F$8,0,(BK34-Basis!$F$8)*0.4))","v":25.6},{"$f":"IF(N34=\"\",\"\",IF(BK34>Basis!$G$8,0,(Basis!$G$8-BK34)*0.4))","v":0},25.6,null,25,20,8.3333333333333339,6.666666666666667]
["HC",null,24," 830384MK","Renske Kroeze","M can do it","RV. Leijeruiters Helvoirt (pv)",null,150,{"$f":"IF(I35=\"\",\"\",IF(ISTEXT(I35),I35,IF(I35<=Basis!$M$8,\"Uit\",(100-(I35/Basis!$L$8*100))*Basis!$Y$6)))","v":50},0,0,20,5,24,{"$f":"IF(N35=\"\",\"\",IF(N35*60+O35>Basis!$U$8,\"Uit\",BL35+BM35))","v":41.6},null,111.6,8.6666666666666661,7.666666666666667,95.266666666666652,"",null,24,0,"-","-","-","-","-",20,"-","-","-","-","-","-","-","-","-","-","-",null,null,null,null,null,null,null,20,null,null,24,null,"09:56:00","10:01:24","00:05:24",5,24,null,{"$f":"IF(K35=\"\",\"\",IF(ISTEXT(K35),K35,IF(K35>Basis!$N$8,\"Uit\",IF(ISBLANK(L35),K35,K35+L35))))","v":0},50,324,{"$f":"IF(N35=\"\",\"\",IF(BK35<=Basis!$F$8,0,(BK35-Basis!$F$8)*0.4))","v":41.6},{"$f":"IF(N35=\"\",\"\",IF(BK35>Basis!$G$8,0,(Basis!$G$8-BK35)*0.4))","v":0},61.6,null,26,23,8.6666666666666661,7.666666666666667]
[null,null,14,null,null,null,null,null,null,{"$f":"IF(I36=\"\",\"\",IF(ISTEXT(I36),I36,IF(I36<=Basis!$M$8,\"Uit\",(100-(I36/Basis!$L$8*100))*Basis!$Y$6)))","v":""},null,null,null,"","",{"$f":"IF(N36=\"\",\"\",IF(N36*60+O36>Basis!$U$8,\"Uit\",BL36+BM36))","v":""},null,"","","","","",null,14,null,null,null,null,null,null,null,null,null,null,null,null,null,null,null,null,null,null,null,null,null,null,null,null,null,"",null,null,14,null,"09:36:00",null,"","","",null,{"$f":"IF(K36=\"\",\"\",IF(ISTEXT(K36),K36,IF(K36>Basis!$N$8,\"Uit\",IF(ISBLANK(L36),K36,K36+L36))))","v":""},"","",{"$f":"IF(N36=\"\",\"\",IF(BK36<=Basis!$F$8,0,(BK36-Basis!$F$8)*0.4))","v":""},{"$f":"IF(N36=\"\",\"\",IF(BK36>Basis!$G$8,0,(Basis!$G$8-BK36)*0.4))","v":""},"",null,null,null,"",""]
[null,null,28,null,null,null,null,null,null,{"$f":"IF(I37=\"\",\"\",IF(ISTEXT(I37),I37,IF(I37<=Basis!$M$8,\"Uit\",(100-(I37/Basis!$L$8*100))*Basis!$Y$6)))","v":""},null,null,{"$f":"IF(AX37=\"\",\"\",AX37)","v":""},"","",{"$f":"IF(N37=\"\",\"\",IF(N37*60+O37>Basis!$U$8,\"Uit\",BL37+BM37))","v":""},null,"","","","","",null,28,null,null,null,null,null,null,null,null,null,null,null,null,null,null,null,null,null,null,null,null,null,null,null,null,null,"",null,null,28,null,"10:04:00",null,"","","",null,{"$f":"IF(K37=\"\",\"\",IF(ISTEXT(K37),K37,IF(K37>Basis!$N$8,\"Uit\",IF(ISBLANK(L37),K37,K37+L37))))","v":""},"","",{"$f":"IF(N37=\"\",\"\",IF(BK37<=Basis!$F$8,0,(BK37-Basis!$F$8)*0.4))","v":""},{"$f":"IF(N37=\"\",\"\",IF(BK37>Basis!$G$8,0,(Basis!$G$8-BK37)*0.4))","v":""},"",null,null,null,"",""]
[null,null,null,null,null,null,null,null,null,{"$f":"IF(I38=\"\",\"\",IF(ISTEXT(I38),I38,IF(I38<=Basis!$M$8,\"Uit\",(100-(I38/Basis!$L$8*100))*Basis!$Y$6)))","v":""},null,null,{"$f":"IF(AX38=\"\",\"\",AX38)","v":""},{"$f":"IF(ISBLANK(BD38),\"\",BF38)","v":""},{"$f":"IF(ISBLANK(BD38),\"\",BG38)","v":""},{"$f":"IF(N38=\"\",\"\",IF(N38*60+O38>Basis!$U$8,\"Uit\",BL38+BM38))","v":""},null,{"$f":"IF(ISTEXT(BJ38),BJ38,IF(OR(ISBLANK(M38),M38=\"\",ISBLANK(Y38)),BJ38,IF(ISTEXT(BN38),BN38,BJ38+BN38)))","v":""},{"$f":"IF(BP38=\"\",\"\",BR38)","v":""},{"$f":"IF(BQ38=\"\",\"\",BS38)","v":""},{"$f":"IF(R38=\"\",\"\",IF(ISTEXT(R38),R38,IF(BP38=\"\",\"\",R38-S38-T38)))","v":""},{"$f":"IF(AY38=\"\",\"\",AY38)","v":""},null,{"$f":"IF($C38=\"\",\"\",$C38)","v":""},null,null,null,null,null,null,null,null,null,null,null,null,null,null,null,null,null,null,null,null,null,null,null,null,null,{"$f":"IF(Y38=\"\",\"\",IF(ISTEXT(Y38),Y38,SUM(Y38:AW38)))","v":""},null,null,{"$f":"IF($C38=\"\",\"\",$C38)","v":""},null,null,null,{"$f":"IF(ISBLANK(BD38),\"\",BD38-BC38)","v":""},{"$f":"IF(ISBLANK(BD38),\"\",MINUTE(BE38))","v":""},{"$f":"IF(ISBLANK(BD38),\"\",SECOND(BE38))","v":""},null,{"$f":"IF(K38=\"\",\"\",IF(ISTEXT(K38),K38,IF(K38>Basis!$N$8,\"Uit\",IF(ISBLANK(L38),K38,K38+L38))))","v":""},{"$f":"IF(OR(ISTEXT(J38),BI38=\"\"),J38,IF(ISTEXT(BI38),BI38,J38+BI38))","v":""},{"$f":"IF(N38=\"\",\"\",N38*60+O38)","v":""},{"$f":"IF(N38=\"\",\"\",IF(BK38<=Basis!$F$8,0,(BK38-Basis!$F$8)*0.4))","v":""},{"$f":"IF(N38=\"\",\"\",IF(BK38>Basis!$G$8,0,(Basis!$G$8-BK38)*0.4))","v":""},{"$f":"IF(M38=\"\",\"\",IF(ISTEXT(M38),M38,IF(ISTEXT(P38),P38,M38+P38)))","v":""},null,null,null,{"$f":"IF(BP38=\"\",\"\",BP38/3)","v":""},{"$f":"IF(BQ38=\"\",\"\",BQ38/3)","v":""}]
[null,null,null,null,null,null,null,null,null,{"$f":"IF(I39=\"\",\"\",IF(ISTEXT(I39),I39,IF(I39<=Basis!$M$8,\"Uit\",(100-(I39/Basis!$L$8*100))*Basis!$Y$6)))","v":""},null,null,"","","",{"$f":"IF(N39=\"\",\"\",IF(N39*60+O39>Basis!$U$8,\"Uit\",BL39+BM39))","v":""},null,"","","","","",null,"",null,null,null,null,null,null,null,null,null,null,null,null,null,null,null,null,null,null,null,null,null,null,null,null,null,"",null,null,"",null,null,null,"","","",null,{"$f":"IF(K39=\"\",\"\",IF(ISTEXT(K39),K39,IF(K39>Basis!$N$8,\"Uit\",IF(ISBLANK(L39),K39,K39+L39))))","v":""},"","",{"$f":"IF(N39=\"\",\"\",IF(BK39<=Basis!$F$8,0,(BK39-Basis!$F$8)*0.4))","v":""},{"$f":"IF(N39=\"\",\"\",IF(BK39>Basis!$G$8,0,(Basis!$G$8-BK39)*0.4))","v":""},"",null,null,null,"",""]
[null,null,null,null,null,null,null,null,null,{"$f":"IF(I40=\"\",\"\",IF(ISTEXT(I40),I40,IF(I40<=Basis!$M$8,\"Uit\",(100-(I40/Basis!$L$8*100))*Basis!$Y$6)))","v":""},null,null,{"$f":"IF(AX40=\"\",\"\",AX40)","v":""},{"$f":"IF(ISBLANK(BD40),\"\",BF40)","v":""},{"$f":"IF(ISBLANK(BD40),\"\",BG40)","v":""},{"$f":"IF(N40=\"\",\"\",IF(N40*60+O40>Basis!$U$8,\"Uit\",BL40+BM40))","v":""},null,{"$f":"IF(ISTEXT(BJ40),BJ40,IF(OR(ISBLANK(M40),M40=\"\",ISBLANK(Y40)),BJ40,IF(ISTEXT(BN40),BN40,BJ40+BN40)))","v":""},{"$f":"IF(BP40=\"\",\"\",BR40)","v":""},"",{"$f":"IF(R40=\"\",\"\",IF(ISTEXT(R40),R40,IF(BP40=\"\",\"\",R40-S40-T40)))","v":""},{"$f":"IF(AY40=\"\",\"\",AY40)","v":""},null,{"$f":"IF($C40=\"\",\"\",$C40)","v":""},null,null,null,null,null,null,null,null,null,null,null,null,null,null,null,null,null,null,null,null,null,null,null,null,null,{"$f":"IF(Y40=\"\",\"\",IF(ISTEXT(Y40),Y40,SUM(Y40:AW40)))","v":""},null,null,{"$f":"IF($C40=\"\",\"\",$C40)","v":""},null,null,null,{"$f":"IF(ISBLANK(BD40),\"\",BD40-BC40)","v":""},{"$f":"IF(ISBLANK(BD40),\"\",MINUTE(BE40))","v":""},{"$f":"IF(ISBLANK(BD40),\"\",SECOND(BE40))","v":""},null,{"$f":"IF(K40=\"\",\"\",IF(ISTEXT(K40),K40,IF(K40>Basis!$N$8,\"Uit\",IF(ISBLANK(L40),K40,K40+L40))))","v":""},{"$f":"IF(OR(ISTEXT(J40),BI40=\"\"),J40,IF(ISTEXT(BI40),BI40,J40+BI40))","v":""},{"$f":"IF(N40=\"\",\"\",N40*60+O40)","v":""},{"$f":"IF(N40=\"\",\"\",IF(BK40<=Basis!$F$8,0,(BK40-Basis!$F$8)*0.4))","v":""},{"$f":"IF(N40=\"\",\"\",IF(BK40>Basis!$G$8,0,(Basis!$G$8-BK40)*0.4))","v":""},{"$f":"IF(M40=\"\",\"\",IF(ISTEXT(M40),M40,IF(ISTEXT(P40),P40,M40+P40)))","v":""},null,null,null,{"$f":"IF(BP40=\"\",\"\",BP40/3)","v":""},""]
["  Bij uitsluiting reden vermelden : ",null,null,null,null,null,null,null,null,null,null,null,null,null,null,{"$f":"NOW()","v":"2018-06-30T22:02:24.880"},null,null,null,null,null,null,null,{"$f":"A41","v":"  Bij uitsluiting reden vermelden : "},null,null,null,null,null,null,null,null,null,null,null,null,null,null,null,null,null,null,null,null,null,null,{"$f":"NOW()","v":"2018-06-30T22:02:24.880"}]
["  VP=val paard, VR=val ruiter, 3W=3 weigeringen op zelfde hindernis, 4W=4 weigeringen totaal, FP=foutief parcours, Vr.v= vrijwillig verlaten",null,null,null,null,null,null,null,null,null,null,null,null,null,null,null,null,null,null,null,null,null,null,{"$f":"A42","v":"  VP=val paard, VR=val ruiter, 3W=3 weigeringen op zelfde hindernis, 4W=4 weigeringen totaal, FP=foutief parcours, Vr.v= vrijwillig verlaten"}]

{"sheet":"Ring 1 - Bpaarden","index":5,"n_rows":24,"n_cols":71,"rows_kept":24,"cut":false,"hidden":false,"merged":[[2,13,2,14],[22,15,22,21],[22,46,22,52]]}
[{"$f":"\" Samengestelde wedstrijd \"&Basis!D5","v":" Samengestelde wedstrijd Eventing Leende 30 juni 2018"},null,null,null,null,null,"Klasse B paarden - Ring 1",null,null,null,"Dressuurjury : ","Ine van de Looij",null,null,null,null,null,null,null,null,null,null,null," Verzamelstaat hindernisfouten in de cross",null,null,null,null,null,null,null,null,null,null,null,null,{"$f":"A1","v":" Samengestelde wedstrijd Eventing Leende 30 juni 2018"},null,null,null,null,null,null,null,null,null,null,null,null,null,null,null,{"$f":"G1&\" \"","v":"Klasse B paarden - Ring 1 "},null," Indien aankomstUUR cross wordt meegedeeld :",null,null,null,null,null," Hulpkolommen",null,null,null,null,null,null," Stijlcijfers :"]
["rank",null,"rugnr","combinatie nr","naam ruiter","naam paard","vereniging / plaats",null,"dressuur","dressuur","hind.ft.","tijd.ft.","hind.ft.","min","sec","tijd.ft.",null,"totaal","(1) stijl","(2) stijl","eind-","reden",null,null,"hindernisnummer",null,null,null,null,null,null,null,null,null,null,null,null,null,null,null,null,null,null,null,null,null,null,null,null,null," ",null,null,null,null,null,null,null,null,null,"Uitslag","NA","tijd (sec)","tijd.ft.","reg.ft.","totaal",null,"Totaal","Totaal","Gemiddelde","Gemiddelde"]
["HC",null,null,null,null,null,null,null,"totaal","strafpntn.","springen","springen","cross","cross",null,{"$f":"Basis!$H$8&\":\"&TEXT(Basis!$I$8,\"00\")","v":"3:40"},null,null,"cijfer","cijfer","totaal","uitsluiting",null,"nr",1,2,3,4,5,6,7,8,"VD",9,"VD",10,11,12,"13ab",14,15,"F",null,null,null,null,null,null,null,"totaal","reden uitsluiting","hind.","nr",null,"Vertrekuur","Aankomst","Tijd","Minuten","Seconden",null,"Springen","Springen","cross","opt.tijd =",{"$f":"Basis!$H$8&\":\"&TEXT(Basis!$I$8,\"00\")","v":"3:40"},"cross",null,"Jury 1","Jury 2","Jury 1","Jury 2"]
[null,null,null,null,null,null,null,null,null,null,null,null,null,null,null,null,null,{"$f":"IF(ISBLANK(I4),\"\",IF(AND(ISBLANK(K4),ISBLANK(Y4)),J4,IF(ISTEXT(K4),K4,IF(OR(ISBLANK(M4),M4=\"\"),J4+K4+L4,IF(ISTEXT(M4),M4,IF(ISBLANK(Y4),J4+K4+L4,J4+K4+L4+M4+P4+Q4))))))","v":""}]
[1,null,60,"778805CH","Melissa Harskamp","Clooney",null,null,199,{"$f":"IF(I5=\"\",\"\",IF(ISTEXT(I5),I5,IF(I5<=Basis!$M$8,\"Uit\",(100-(I5/Basis!$L$8*100))*Basis!$Y$6)))","v":33.666666666666671},0,0,{"$f":"IF(AX5=\"\",\"\",AX5)","v":0},{"$f":"IF(ISBLANK(BD5),\"\",BF5)","v":4},{"$f":"IF(ISBLANK(BD5),\"\",BG5)","v":3},{"$f":"IF(N5=\"\",\"\",IF(N5*60+O5>Basis!$U$8,\"Uit\",BL5+BM5))","v":9.2000000000000011},null,{"$f":"IF(ISTEXT(BJ5),BJ5,IF(OR(ISBLANK(M5),M5=\"\",ISBLANK(Y5)),BJ5,IF(ISTEXT(BN5),BN5,BJ5+BN5)))","v":42.866666666666674},{"$f":"IF(BP5=\"\",\"\",BR5)","v":7.5},{"$f":"IF(BQ5=\"\",\"\",BS5)","v":7.166666666666667},{"$f":"IF(R5=\"\",\"\",IF(ISTEXT(R5),R5,IF(BP5=\"\",\"\",R5-S5-T5)))","v":28.200000000000006},{"$f":"IF(AY5=\"\",\"\",AY5)","v":""},null,{"$f":"IF($C5=\"\",\"\",$C5)","v":60},0,"-","-","-","-","-","-","-","-","-","-","-","-","-","-","-","-","-",null,null,null,null,null,null,null,{"$f":"IF(Y5=\"\",\"\",IF(ISTEXT(Y5),Y5,SUM(Y5:AW5)))","v":0},null,null,{"$f":"IF($C5=\"\",\"\",$C5)","v":60},null,"11:08:00","11:12:03",{"$f":"IF(ISBLANK(BD5),\"\",BD5-BC5)","v":"00:04:03"},{"$f":"IF(ISBLANK(BD5),\"\",MINUTE(BE5))","v":4},{"$f":"IF(ISBLANK(BD5),\"\",SECOND(BE5))","v":3},null,{"$f":"IF(K5=\"\",\"\",IF(ISTEXT(K5),K5,IF(K5>Basis!$N$8,\"Uit\",IF(ISBLANK(L5),K5,K5+L5))))","v":0},{"$f":"IF(OR(ISTEXT(J5),BI5=\"\"),J5,IF(ISTEXT(BI5),BI5,J5+BI5))","v":33.666666666666671},{"$f":"IF(N5=\"\",\"\",N5*60+O5)","v":243},{"$f":"IF(N5=\"\",\"\",IF(BK5<=Basis!$F$8,0,(BK5-Basis!$F$8)*0.4))","v":9.2000000000000011},{"$f":"IF(N5=\"\",\"\",IF(BK5>Basis!$G$8,0,(Basis!$G$8-BK5)*0.4))","v":0},{"$f":"IF(M5=\"\",\"\",IF(ISTEXT(M5),M5,IF(ISTEXT(P5),P5,M5+P5)))","v":9.2000000000000011},null,22.5,21.5,{"$f":"IF(BP5=\"\",\"\",BP5/3)","v":7.5},{"$f":"IF(BQ5=\"\",\"\",BQ5/3)","v":7.166666666666667}]
[2,null,48,"817671MF","Sabine Franken","Mona Fay","RV. Ysselsteyn",null,200,{"$f":"IF(I6=\"\",\"\",IF(ISTEXT(I6),I6,IF(I6<=Basis!$M$8,\"Uit\",(100-(I6/Basis!$L$8*100))*Basis!$Y$6)))","v":33.333333333333343},0,0,0,4,3,{"$f":"IF(N6=\"\",\"\",IF(N6*60+O6>Basis!$U$8,\"Uit\",BL6+BM6))","v":9.2000000000000011},null,42.533333333333346,6,6.833333333333333,29.700000000000014,"",null,48,0,"-","-","-","-","-","-","-","-","-","-","-","-","-","-","-","-","-",null,null,null,null,null,null,null,0,null,null,48,null,"10:44:00","10:48:03","00:04:03",4,3,null,{"$f":"IF(K6=\"\",\"\",IF(ISTEXT(K6),K6,IF(K6>Basis!$N$8,\"Uit\",IF(ISBLANK(L6),K6,K6+L6))))","v":0},33.333333333333343,243,{"$f":"IF(N6=\"\",\"\",IF(BK6<=Basis!$F$8,0,(BK6-Basis!$F$8)*0.4))","v":9.2000000000000011},{"$f":"IF(N6=\"\",\"\",IF(BK6>Basis!$G$8,0,(Basis!$G$8-BK6)*0.4))","v":0},9.2000000000000011,null,18,20.5,6,6.833333333333333]
[3,null,38,"782500DD","Britt Dieteren","Dynamic H","RV. Gele Ruiters",null,195,{"$f":"IF(I7=\"\",\"\",IF(ISTEXT(I7),I7,IF(I7<=Basis!$M$8,\"Uit\",(100-(I7/Basis!$L$8*100))*Basis!$Y$6)))","v":35},0,0,0,4,14,{"$f":"IF(N7=\"\",\"\",IF(N7*60+O7>Basis!$U$8,\"Uit\",BL7+BM7))","v":13.600000000000001},null,48.6,8,6.833333333333333,33.766666666666666,"",null,38,0,"-","-","-","-","-","-","-","-","-","-","-","-","-","-","-","-","-",null,null,null,null,null,null,null,0,null,null,38,null,"10:24:00","10:28:14","00:04:14",4,14,null,{"$f":"IF(K7=\"\",\"\",IF(ISTEXT(K7),K7,IF(K7>Basis!$N$8,\"Uit\",IF(ISBLANK(L7),K7,K7+L7))))","v":0},35,254,{"$f":"IF(N7=\"\",\"\",IF(BK7<=Basis!$F$8,0,(BK7-Basis!$F$8)*0.4))","v":13.600000000000001},{"$f":"IF(N7=\"\",\"\",IF(BK7>Basis!$G$8,0,(Basis!$G$8-BK7)*0.4))","v":0},13.600000000000001,null,24,20.5,8,6.833333333333333]
[4,null,40,"790552KH","Loes Hamelers","Kaweise Elliot","RV. Molenberg (R.j.v.)",null,200.5,{"$f":"IF(I8=\"\",\"\",IF(ISTEXT(I8),I8,IF(I8<=Basis!$M$8,\"Uit\",(100-(I8/Basis!$L$8*100))*Basis!$Y$6)))","v":33.166666666666671},0,0,0,4,24,{"$f":"IF(N8=\"\",\"\",IF(N8*60+O8>Basis!$U$8,\"Uit\",BL8+BM8))","v":17.600000000000001},null,50.766666666666673,8.3333333333333339,7.666666666666667,34.766666666666673,"",null,40,0,"-","-","-","-","-","-","-","-","-","-","-","-","-","-","-","-","-",null,null,null,null,null,null,null,0,null,null,40,null,"10:28:00","10:32:24","00:04:24",4,24,null,{"$f":"IF(K8=\"\",\"\",IF(ISTEXT(K8),K8,IF(K8>Basis!$N$8,\"Uit\",IF(ISBLANK(L8),K8,K8+L8))))","v":0},33.166666666666671,264,{"$f":"IF(N8=\"\",\"\",IF(BK8<=Basis!$F$8,0,(BK8-Basis!$F$8)*0.4))","v":17.600000000000001},{"$f":"IF(N8=\"\",\"\",IF(BK8>Basis!$G$8,0,(Basis!$G$8-BK8)*0.4))","v":0},17.600000000000001,null,25,23,8.3333333333333339,7.666666666666667]
[5,null,42,"802111CG","Kimberly de Groot","Champ","RV. Odulphus (pv. Best)",null,187.5,{"$f":"IF(I9=\"\",\"\",IF(ISTEXT(I9),I9,IF(I9<=Basis!$M$8,\"Uit\",(100-(I9/Basis!$L$8*100))*Basis!$Y$6)))","v":37.5},0,0,0,4,27,{"$f":"IF(N9=\"\",\"\",IF(N9*60+O9>Basis!$U$8,\"Uit\",BL9+BM9))","v":18.8},null,56.3,8.3333333333333339,6.666666666666667,41.3,"",null,42,0,"-","-","-","-","-","-","-","-","-","-","-","-","-","-","-","-","-",null,null,null,null,null,null,null,0,null,null,42,null,"10:32:00","10:36:27","00:04:27",4,27,null,{"$f":"IF(K9=\"\",\"\",IF(ISTEXT(K9),K9,IF(K9>Basis!$N$8,\"Uit\",IF(ISBLANK(L9),K9,K9+L9))))","v":0},37.5,267,{"$f":"IF(N9=\"\",\"\",IF(BK9<=Basis!$F$8,0,(BK9-Basis!$F$8)*0.4))","v":18.8},{"$f":"IF(N9=\"\",\"\",IF(BK9>Basis!$G$8,0,(Basis!$G$8-BK9)*0.4))","v":0},18.8,null,25,20,8.3333333333333339,6.666666666666667]
[6,null,44,"Belgie","Karolien de Keyser","Weissenas Waikiki",null,null,182,{"$f":"IF(I10=\"\",\"\",IF(ISTEXT(I10),I10,IF(I10<=Basis!$M$8,\"Uit\",(100-(I10/Basis!$L$8*100))*Basis!$Y$6)))","v":39.333333333333329},0,0,0,4,27,{"$f":"IF(N10=\"\",\"\",IF(N10*60+O10>Basis!$U$8,\"Uit\",BL10+BM10))","v":18.8},null,58.133333333333326,7,6.833333333333333,44.29999999999999,"",null,44,0,"-","-","-","-","-","-","-","-","-","-","-","-","-","-","-","-","-",null,null,null,null,null,null,null,0,null,null,44,null,"10:36:00","10:40:27","00:04:27",4,27,null,{"$f":"IF(K10=\"\",\"\",IF(ISTEXT(K10),K10,IF(K10>Basis!$N$8,\"Uit\",IF(ISBLANK(L10),K10,K10+L10))))","v":0},39.333333333333329,267,{"$f":"IF(N10=\"\",\"\",IF(BK10<=Basis!$F$8,0,(BK10-Basis!$F$8)*0.4))","v":18.8},{"$f":"IF(N10=\"\",\"\",IF(BK10>Basis!$G$8,0,(Basis!$G$8-BK10)*0.4))","v":0},18.8,null,21,20.5,7,6.833333333333333]
[7,null,46,"850470FS","Kerensa Smis","Finesse Kera","RV. Vereniging Riders Club Asten",null,175.5,{"$f":"IF(I11=\"\",\"\",IF(ISTEXT(I11),I11,IF(I11<=Basis!$M$8,\"Uit\",(100-(I11/Basis!$L$8*100))*Basis!$Y$6)))","v":41.5},4,0,0,4,18,{"$f":"IF(N11=\"\",\"\",IF(N11*60+O11>Basis!$U$8,\"Uit\",BL11+BM11))","v":15.200000000000001},null,60.7,7.666666666666667,6.333333333333333,46.7,"",null,46,0,"-","-","-","-","-","-","-","-","-","-","-","-","-","-","-","-","-",null,null,null,null,null,null,null,0,null,null,46,null,"10:40:00","10:44:18","00:04:18",4,18,null,{"$f":"IF(K11=\"\",\"\",IF(ISTEXT(K11),K11,IF(K11>Basis!$N$8,\"Uit\",IF(ISBLANK(L11),K11,K11+L11))))","v":4},45.5,258,{"$f":"IF(N11=\"\",\"\",IF(BK11<=Basis!$F$8,0,(BK11-Basis!$F$8)*0.4))","v":15.200000000000001},{"$f":"IF(N11=\"\",\"\",IF(BK11>Basis!$G$8,0,(Basis!$G$8-BK11)*0.4))","v":0},15.200000000000001,null,23,19,7.666666666666667,6.333333333333333]
[8,null,34,"814876MF","Yorick Faasse","Melchior junior","RV. Sé-Ros",null,186,{"$f":"IF(I12=\"\",\"\",IF(ISTEXT(I12),I12,IF(I12<=Basis!$M$8,\"Uit\",(100-(I12/Basis!$L$8*100))*Basis!$Y$6)))","v":38},0,0,0,4,34,{"$f":"IF(N12=\"\",\"\",IF(N12*60+O12>Basis!$U$8,\"Uit\",BL12+BM12))","v":21.6},null,59.6,5.833333333333333,6.666666666666667,47.1,"",null,34,0,"-","-","-","-","-","-","-","-","-","-","-","-","-","-","-","-","-",null,null,null,null,null,null,null,0,null,null,34,null,"10:16:00","10:20:34","00:04:34",4,34,null,{"$f":"IF(K12=\"\",\"\",IF(ISTEXT(K12),K12,IF(K12>Basis!$N$8,\"Uit\",IF(ISBLANK(L12),K12,K12+L12))))","v":0},38,274,{"$f":"IF(N12=\"\",\"\",IF(BK12<=Basis!$F$8,0,(BK12-Basis!$F$8)*0.4))","v":21.6},{"$f":"IF(N12=\"\",\"\",IF(BK12>Basis!$G$8,0,(Basis!$G$8-BK12)*0.4))","v":0},21.6,null,17.5,20,5.833333333333333,6.666666666666667]
[9,null,54,"Belgie","Edith Tuytelaars","Nalan van 't Greesa",null,null,174.5,{"$f":"IF(I13=\"\",\"\",IF(ISTEXT(I13),I13,IF(I13<=Basis!$M$8,\"Uit\",(100-(I13/Basis!$L$8*100))*Basis!$Y$6)))","v":41.833333333333336},4,0,0,4,24,{"$f":"IF(N13=\"\",\"\",IF(N13*60+O13>Basis!$U$8,\"Uit\",BL13+BM13))","v":17.600000000000001},null,63.433333333333337,8.1666666666666661,7.5,47.766666666666673,"",null,54,0,"-","-","-","-","-","-","-","-","-","-","-","-","-","-","-","-","-",null,null,null,null,null,null,null,0,null,null,54,null,"10:56:00","11:00:24","00:04:24",4,24,null,{"$f":"IF(K13=\"\",\"\",IF(ISTEXT(K13),K13,IF(K13>Basis!$N$8,\"Uit\",IF(ISBLANK(L13),K13,K13+L13))))","v":4},45.833333333333336,264,{"$f":"IF(N13=\"\",\"\",IF(BK13<=Basis!$F$8,0,(BK13-Basis!$F$8)*0.4))","v":17.600000000000001},{"$f":"IF(N13=\"\",\"\",IF(BK13>Basis!$G$8,0,(Basis!$G$8-BK13)*0.4))","v":0},17.600000000000001,null,24.5,22.5,8.1666666666666661,7.5]
[10,null,62,"812870DG","Jessica Teygeler-Goudriaan","Dubbeltje JG","RV. Angerlo Keppel Langerak",null,173,{"$f":"IF(I14=\"\",\"\",IF(ISTEXT(I14),I14,IF(I14<=Basis!$M$8,\"Uit\",(100-(I14/Basis!$L$8*100))*Basis!$Y$6)))","v":42.333333333333336},4,0,0,4,30,{"$f":"IF(N14=\"\",\"\",IF(N14*60+O14>Basis!$U$8,\"Uit\",BL14+BM14))","v":20},null,66.333333333333343,6.333333333333333,6.666666666666667,53.333333333333343,"",null,62,0,"-","-","-","-","-","-","-","-","-","-","-","-","-","-","-","-","-",null,null,null,null,null,null,null,0,null,null,62,null,"11:12:00","11:16:30","00:04:30",4,30,null,{"$f":"IF(K14=\"\",\"\",IF(ISTEXT(K14),K14,IF(K14>Basis!$N$8,\"Uit\",IF(ISBLANK(L14),K14,K14+L14))))","v":4},46.333333333333336,270,{"$f":"IF(N14=\"\",\"\",IF(BK14<=Basis!$F$8,0,(BK14-Basis!$F$8)*0.4))","v":20},{"$f":"IF(N14=\"\",\"\",IF(BK14>Basis!$G$8,0,(Basis!$G$8-BK14)*0.4))","v":0},20,null,19,20,6.333333333333333,6.666666666666667]
[11,null,32,"850723LD","Frederique Donders","Last Minute","RV. Arion",null,173,{"$f":"IF(I15=\"\",\"\",IF(ISTEXT(I15),I15,IF(I15<=Basis!$M$8,\"Uit\",(100-(I15/Basis!$L$8*100))*Basis!$Y$6)))","v":42.333333333333336},8,16,0,3,55,{"$f":"IF(N15=\"\",\"\",IF(N15*60+O15>Basis!$U$8,\"Uit\",BL15+BM15))","v":6},null,72.333333333333343,6.833333333333333,6.833333333333333,58.666666666666679,"",null,32,0,"-","-","-","-","-","-","-","-","-","-","-","-","-","-","-","-","-",null,null,null,null,null,null,null,0,null,null,32,null,"10:11:00","10:14:55","00:03:55",3,55,null,{"$f":"IF(K15=\"\",\"\",IF(ISTEXT(K15),K15,IF(K15>Basis!$N$8,\"Uit\",IF(ISBLANK(L15),K15,K15+L15))))","v":24},66.333333333333343,235,{"$f":"IF(N15=\"\",\"\",IF(BK15<=Basis!$F$8,0,(BK15-Basis!$F$8)*0.4))","v":6},{"$f":"IF(N15=\"\",\"\",IF(BK15>Basis!$G$8,0,(Basis!$G$8-BK15)*0.4))","v":0},6,null,20.5,20.5,6.833333333333333,6.833333333333333]
[12,null,30,"580801BL","Irene van Lankvelt","Bono","RV. Sint Joris",null,210.5,{"$f":"IF(I16=\"\",\"\",IF(ISTEXT(I16),I16,IF(I16<=Basis!$M$8,\"Uit\",(100-(I16/Basis!$L$8*100))*Basis!$Y$6)))","v":29.833333333333329},4,0,20,4,50,{"$f":"IF(N16=\"\",\"\",IF(N16*60+O16>Basis!$U$8,\"Uit\",BL16+BM16))","v":28},null,81.833333333333329,7,7.166666666666667,67.666666666666657,"",null,30,20,"-","-","-","-","-","-","-","-","-","-","-","-","-","-","-","-","-",null,null,null,null,null,null,null,20,null,null,30,null,"10:08:00","10:12:50","00:04:50",4,50,null,{"$f":"IF(K16=\"\",\"\",IF(ISTEXT(K16),K16,IF(K16>Basis!$N$8,\"Uit\",IF(ISBLANK(L16),K16,K16+L16))))","v":4},33.833333333333329,290,{"$f":"IF(N16=\"\",\"\",IF(BK16<=Basis!$F$8,0,(BK16-Basis!$F$8)*0.4))","v":28},{"$f":"IF(N16=\"\",\"\",IF(BK16>Basis!$G$8,0,(Basis!$G$8-BK16)*0.4))","v":0},48,null,21,21.5,7,7.166666666666667]
[13,null,58,"Belgie","Pascal Goffart","Neo Z",null,null,179,{"$f":"IF(I17=\"\",\"\",IF(ISTEXT(I17),I17,IF(I17<=Basis!$M$8,\"Uit\",(100-(I17/Basis!$L$8*100))*Basis!$Y$6)))","v":40.333333333333329},4,0,20,4,52,{"$f":"IF(N17=\"\",\"\",IF(N17*60+O17>Basis!$U$8,\"Uit\",BL17+BM17))","v":28.8},null,93.133333333333326,7.333333333333333,6.166666666666667,79.633333333333326,"",null,58,0,"-","-","-","-","-","-","-","-","-","-","-","-","-",20,"-","-","-",null,null,null,null,null,null,null,20,null,null,58,null,"11:04:00","11:08:52","00:04:52",4,52,null,{"$f":"IF(K17=\"\",\"\",IF(ISTEXT(K17),K17,IF(K17>Basis!$N$8,\"Uit\",IF(ISBLANK(L17),K17,K17+L17))))","v":4},44.333333333333329,292,{"$f":"IF(N17=\"\",\"\",IF(BK17<=Basis!$F$8,0,(BK17-Basis!$F$8)*0.4))","v":28.8},{"$f":"IF(N17=\"\",\"\",IF(BK17>Basis!$G$8,0,(Basis!$G$8-BK17)*0.4))","v":0},48.8,null,22,18.5,7.333333333333333,6.166666666666667]
[14,null,50,"736336BO","Etiënne Olberts","Bonera","RV. Ravensbosch",null,198,{"$f":"IF(I18=\"\",\"\",IF(ISTEXT(I18),I18,IF(I18<=Basis!$M$8,\"Uit\",(100-(I18/Basis!$L$8*100))*Basis!$Y$6)))","v":34},0,0,"Uit",4,18,{"$f":"IF(N18=\"\",\"\",IF(N18*60+O18>Basis!$U$8,\"Uit\",BL18+BM18))","v":15.200000000000001},null,"Uit",8.1666666666666661,6.333333333333333,"Uit","FP h.9",null,50,0,"-","-","-","-","-","-","-","-","FP","-","-","-","-","FP","-","-","-",null,null,null,null,null,null,null,"Uit","FP h.9",null,50,null,"10:48:00","10:52:18","00:04:18",4,18,null,{"$f":"IF(K18=\"\",\"\",IF(ISTEXT(K18),K18,IF(K18>Basis!$N$8,\"Uit\",IF(ISBLANK(L18),K18,K18+L18))))","v":0},34,258,{"$f":"IF(N18=\"\",\"\",IF(BK18<=Basis!$F$8,0,(BK18-Basis!$F$8)*0.4))","v":15.200000000000001},{"$f":"IF(N18=\"\",\"\",IF(BK18>Basis!$G$8,0,(Basis!$G$8-BK18)*0.4))","v":0},"Uit",null,24.5,19,8.1666666666666661,6.333333333333333]
[15,null,56,"810132EH","Ronald Hillenaar","Edelweis","RV. Berg En Dal Ruiters",null,188,{"$f":"IF(I19=\"\",\"\",IF(ISTEXT(I19),I19,IF(I19<=Basis!$M$8,\"Uit\",(100-(I19/Basis!$L$8*100))*Basis!$Y$6)))","v":37.333333333333329},0,0,"Uit",4,30,{"$f":"IF(N19=\"\",\"\",IF(N19*60+O19>Basis!$U$8,\"Uit\",BL19+BM19))","v":20},null,"Uit",6.333333333333333,6.5,"Uit","FP h.4",null,56,20,"-","-","FP","-","-","-","-","-","-","-","-","-","-","-","-","-","-",null,null,null,null,null,null,null,"Uit","FP h.4",null,56,null,"11:00:00","11:04:30","00:04:30",4,30,null,{"$f":"IF(K19=\"\",\"\",IF(ISTEXT(K19),K19,IF(K19>Basis!$N$8,\"Uit\",IF(ISBLANK(L19),K19,K19+L19))))","v":0},37.333333333333329,270,{"$f":"IF(N19=\"\",\"\",IF(BK19<=Basis!$F$8,0,(BK19-Basis!$F$8)*0.4))","v":20},{"$f":"IF(N19=\"\",\"\",IF(BK19>Basis!$G$8,0,(Basis!$G$8-BK19)*0.4))","v":0},"Uit",null,19,19.5,6.333333333333333,6.5]
[null,null,null,null,null,null,null,null,null,{"$f":"IF(I20=\"\",\"\",IF(ISTEXT(I20),I20,IF(I20<=Basis!$M$8,\"Uit\",(100-(I20/Basis!$L$8*100))*Basis!$Y$6)))","v":""},null,null,{"$f":"IF(AX20=\"\",\"\",AX20)","v":""},{"$f":"IF(ISBLANK(BD20),\"\",BF20)","v":""},{"$f":"IF(ISBLANK(BD20),\"\",BG20)","v":""},{"$f":"IF(N20=\"\",\"\",IF(N20*60+O20>Basis!$U$8,\"Uit\",BL20+BM20))","v":""},null,{"$f":"IF(ISTEXT(BJ20),BJ20,IF(OR(ISBLANK(M20),M20=\"\",ISBLANK(Y20)),BJ20,IF(ISTEXT(BN20),BN20,BJ20+BN20)))","v":""},{"$f":"IF(BP20=\"\",\"\",BR20)","v":""},{"$f":"IF(BQ20=\"\",\"\",BS20)","v":""},{"$f":"IF(R20=\"\",\"\",IF(ISTEXT(R20),R20,IF(BP20=\"\",\"\",R20-S20-T20)))","v":""},{"$f":"IF(AY20=\"\",\"\",AY20)","v":""},null,{"$f":"IF($C20=\"\",\"\",$C20)","v":""},null,null,null,null,null,null,null,null,null,null,null,null,null,null,null,null,null,null,null,null,null,null,null,null,null,{"$f":"IF(Y20=\"\",\"\",IF(ISTEXT(Y20),Y20,SUM(Y20:AW20)))","v":""},null,null,{"$f":"IF($C20=\"\",\"\",$C20)","v":""},null,null,null,{"$f":"IF(ISBLANK(BD20),\"\",BD20-BC20)","v":""},{"$f":"IF(ISBLANK(BD20),\"\",MINUTE(BE20))","v":""},{"$f":"IF(ISBLANK(BD20),\"\",SECOND(BE20))","v":""},null,{"$f":"IF(K20=\"\",\"\",IF(ISTEXT(K20),K20,IF(K20>Basis!$N$8,\"Uit\",IF(ISBLANK(L20),K20,K20+L20))))","v":""},{"$f":"IF(OR(ISTEXT(J20),BI20=\"\"),J20,IF(ISTEXT(BI20),BI20,J20+BI20))","v":""},{"$f":"IF(N20=\"\",\"\",N20*60+O20)","v":""},{"$f":"IF(N20=\"\",\"\",IF(BK20<=Basis!$F$8,0,(BK20-Basis!$F$8)*0.4))","v":""},{"$f":"IF(N20=\"\",\"\",IF(BK20>Basis!$G$8,0,(Basis!$G$8-BK20)*0.4))","v":""},{"$f":"IF(M20=\"\",\"\",IF(ISTEXT(M20),M20,IF(ISTEXT(P20),P20,M20+P20)))","v":""},null,null,null,{"$f":"IF(BP20=\"\",\"\",BP20/3)","v":""},{"$f":"IF(BQ20=\"\",\"\",BQ20/3)","v":""}]
[null,null,null,null,null,null,null,null,null,{"$f":"IF(I21=\"\",\"\",IF(ISTEXT(I21),I21,IF(I21<=Basis!$M$8,\"Uit\",(100-(I21/Basis!$L$8*100))*Basis!$Y$6)))","v":""},null,null,"","","",{"$f":"IF(N21=\"\",\"\",IF(N21*60+O21>Basis!$U$8,\"Uit\",BL21+BM21))","v":""},null,"","","","","",null,"",null,null,null,null,null,null,null,null,null,null,null,null,null,null,null,null,null,null,null,null,null,null,null,null,null,"",null,null,"",null,null,null,"","","",null,{"$f":"IF(K21=\"\",\"\",IF(ISTEXT(K21),K21,IF(K21>Basis!$N$8,\"Uit\",IF(ISBLANK(L21),K21,K21+L21))))","v":""},"","",{"$f":"IF(N21=\"\",\"\",IF(BK21<=Basis!$F$8,0,(BK21-Basis!$F$8)*0.4))","v":""},{"$f":"IF(N21=\"\",\"\",IF(BK21>Basis!$G$8,0,(Basis!$G$8-BK21)*0.4))","v":""},"",null,null,null,"",""]
[null,null,null,null,null,null,null,null,null,{"$f":"IF(I22=\"\",\"\",IF(ISTEXT(I22),I22,IF(I22<=Basis!$M$8,\"Uit\",(100-(I22/Basis!$L$8*100))*Basis!$Y$6)))","v":""},null,null,{"$f":"IF(AX22=\"\",\"\",AX22)","v":""},{"$f":"IF(ISBLANK(BD22),\"\",BF22)","v":""},{"$f":"IF(ISBLANK(BD22),\"\",BG22)","v":""},{"$f":"IF(N22=\"\",\"\",IF(N22*60+O22>Basis!$U$8,\"Uit\",BL22+BM22))","v":""},null,{"$f":"IF(ISTEXT(BJ22),BJ22,IF(OR(ISBLANK(M22),M22=\"\",ISBLANK(Y22)),BJ22,IF(ISTEXT(BN22),BN22,BJ22+BN22)))","v":""},{"$f":"IF(BP22=\"\",\"\",BR22)","v":""},{"$f":"IF(BQ22=\"\",\"\",BS22)","v":""},{"$f":"IF(R22=\"\",\"\",IF(ISTEXT(R22),R22,IF(BP22=\"\",\"\",R22-S22-T22)))","v":""},{"$f":"IF(AY22=\"\",\"\",AY22)","v":""},null,{"$f":"IF($C22=\"\",\"\",$C22)","v":""},null,null,null,null,null,null,null,null,null,null,null,null,null,null,null,null,null,null,null,null,null,null,null,null,null,{"$f":"IF(Y22=\"\",\"\",IF(ISTEXT(Y22),Y22,SUM(Y22:AW22)))","v":""},null,null,{"$f":"IF($C22=\"\",\"\",$C22)","v":""},null,null,null,{"$f":"IF(ISBLANK(BD22),\"\",BD22-BC22)","v":""},{"$f":"IF(ISBLANK(BD22),\"\",MINUTE(BE22))","v":""},{"$f":"IF(ISBLANK(BD22),\"\",SECOND(BE22))","v":""},null,{"$f":"IF(K22=\"\",\"\",IF(ISTEXT(K22),K22,IF(K22>Basis!$N$8,\"Uit\",IF(ISBLANK(L22),K22,K22+L22))))","v":""},{"$f":"IF(OR(ISTEXT(J22),BI22=\"\"),J22,IF(ISTEXT(BI22),BI22,J22+BI22))","v":""},{"$f":"IF(N22=\"\",\"\",N22*60+O22)","v":""},{"$f":"IF(N22=\"\",\"\",IF(BK22<=Basis!$F$8,0,(BK22-Basis!$F$8)*0.4))","v":""},{"$f":"IF(N22=\"\",\"\",IF(BK22>Basis!$G$8,0,(Basis!$G$8-BK22)*0.4))","v":""},{"$f":"IF(M22=\"\",\"\",IF(ISTEXT(M22),M22,IF(ISTEXT(P22),P22,M22+P22)))","v":""},null,null,null,{"$f":"IF(BP22=\"\",\"\",BP22/3)","v":""},{"$f":"IF(BQ22=\"\",\"\",BQ22/3)","v":""}]
["  Bij uitsluiting reden vermelden : ",null,null,null,null,null,null,null,null,null,null,null,null,null,null,{"$f":"NOW()","v":"2018-06-30T22:02:24.880"},null,null,null,null,null,null,null,{"$f":"A23","v":"  Bij uitsluiting reden vermelden : "},null,null,null,null,null,null,null,null,null,null,null,null,null,null,null,null,null,null,null,null,null,null,{"$f":"NOW()","v":"2018-06-30T22:02:24.880"}]
["  VP=val paard, VR=val ruiter, 3W=3 weigeringen op zelfde hindernis, 4W=4 weigeringen totaal, FP=foutief parcours, Vr.v= vrijwillig verlaten",null,null,null,null,null,null,null,null,null,null,null,null,null,null,null,null,null,null,null,null,null,null,{"$f":"A24","v":"  VP=val paard, VR=val ruiter, 3W=3 weigeringen op zelfde hindernis, 4W=4 weigeringen totaal, FP=foutief parcours, Vr.v= vrijwillig verlaten"}]

{"sheet":"Ring 2 - Bpaarden","index":6,"n_rows":24,"n_cols":71,"rows_kept":24,"cut":false,"hidden":false,"merged":[[2,13,2,14],[22,15,22,21],[22,46,22,52]]}
[{"$f":"\" Samengestelde wedstrijd \"&Basis!D5","v":" Samengestelde wedstrijd Eventing Leende 30 juni 2018"},null,null,null,null,null,"Klasse B paarden - Ring 2",null,null,null,"Dressuurjury : ","Martine van Winden",null,null,null,null,null,null,null,null,null,null,null," Verzamelstaat hindernisfouten in de cross",null,null,null,null,null,null,null,null,null,null,null,null,{"$f":"A1","v":" Samengestelde wedstrijd Eventing Leende 30 juni 2018"},null,null,null,null,null,null,null,null,null,null,null,null,null,null,null,{"$f":"G1&\" \"","v":"Klasse B paarden - Ring 2 "},null," Indien aankomstUUR cross wordt meegedeeld :",null,null,null,null,null," Hulpkolommen",null,null,null,null,null,null," Stijlcijfers :"]
["rank",null,"rugnr","combinatie nr","naam ruiter","naam paard","vereniging / plaats",null,"dressuur","dressuur","hind.ft.","tijd.ft.","hind.ft.","min","sec","tijd.ft.",null,"totaal","(1) stijl","(2) stijl","eind-","reden",null,null,"hindernisnummer",null,null,null,null,null,null,null,null,null,null,null,null,null,null,null,null,null,null,null,null,null,null,null,null,null," ",null,null,null,null,null,null,null,null,null,"Uitslag","NA","tijd (sec)","tijd.ft.","reg.ft.","totaal",null,"Totaal","Totaal","Gemiddelde","Gemiddelde"]
["HC",null,null,null,null,null,null,null,"totaal","strafpntn.","springen","springen","cross","cross",null,{"$f":"Basis!$H$8&\":\"&TEXT(Basis!$I$8,\"00\")","v":"3:40"},null,null,"cijfer","cijfer","totaal","uitsluiting",null,"nr",1,2,3,4,5,6,7,8,"VD",9,"VD",10,11,12,"13ab",14,15,"F",null,null,null,null,null,null,null,"totaal","reden uitsluiting","hind.","nr",null,"Vertrekuur","Aankomst","Tijd","Minuten","Seconden",null,"Springen","Springen","cross","opt.tijd =",{"$f":"Basis!$H$8&\":\"&TEXT(Basis!$I$8,\"00\")","v":"3:40"},"cross",null,"Jury 1","Jury 2","Jury 1","Jury 2"]
[null,null,null,null,null,null,null,null,null,null,null,null,null,null,null,null,null,{"$f":"IF(ISBLANK(I4),\"\",IF(AND(ISBLANK(K4),ISBLANK(Y4)),J4,IF(ISTEXT(K4),K4,IF(OR(ISBLANK(M4),M4=\"\"),J4+K4+L4,IF(ISTEXT(M4),M4,IF(ISBLANK(Y4),J4+K4+L4,J4+K4+L4+M4+P4+Q4))))))","v":""}]
[1,null,39,"840366FW","Simone Willems","Freire","RV. Ysselsteyn",null,207.5,{"$f":"IF(I5=\"\",\"\",IF(ISTEXT(I5),I5,IF(I5<=Basis!$M$8,\"Uit\",(100-(I5/Basis!$L$8*100))*Basis!$Y$6)))","v":30.833333333333329},0,0,{"$f":"IF(AX5=\"\",\"\",AX5)","v":0},{"$f":"IF(ISBLANK(BD5),\"\",BF5)","v":3},{"$f":"IF(ISBLANK(BD5),\"\",BG5)","v":57},{"$f":"IF(N5=\"\",\"\",IF(N5*60+O5>Basis!$U$8,\"Uit\",BL5+BM5))","v":6.8000000000000007},null,{"$f":"IF(ISTEXT(BJ5),BJ5,IF(OR(ISBLANK(M5),M5=\"\",ISBLANK(Y5)),BJ5,IF(ISTEXT(BN5),BN5,BJ5+BN5)))","v":37.633333333333326},{"$f":"IF(BP5=\"\",\"\",BR5)","v":8},{"$f":"IF(BQ5=\"\",\"\",BS5)","v":7.5},{"$f":"IF(R5=\"\",\"\",IF(ISTEXT(R5),R5,IF(BP5=\"\",\"\",R5-S5-T5)))","v":22.133333333333326},{"$f":"IF(AY5=\"\",\"\",AY5)","v":""},null,{"$f":"IF($C5=\"\",\"\",$C5)","v":39},0,"-","-","-","-","-","-","-","-","-","-","-","-","-","-","-","-","-",null,null,null,null,null,null,null,{"$f":"IF(Y5=\"\",\"\",IF(ISTEXT(Y5),Y5,SUM(Y5:AW5)))","v":0},null,null,{"$f":"IF($C5=\"\",\"\",$C5)","v":39},null,"10:26:00","10:29:57",{"$f":"IF(ISBLANK(BD5),\"\",BD5-BC5)","v":"00:03:57"},{"$f":"IF(ISBLANK(BD5),\"\",MINUTE(BE5))","v":3},{"$f":"IF(ISBLANK(BD5),\"\",SECOND(BE5))","v":57},null,{"$f":"IF(K5=\"\",\"\",IF(ISTEXT(K5),K5,IF(K5>Basis!$N$8,\"Uit\",IF(ISBLANK(L5),K5,K5+L5))))","v":0},{"$f":"IF(OR(ISTEXT(J5),BI5=\"\"),J5,IF(ISTEXT(BI5),BI5,J5+BI5))","v":30.833333333333329},{"$f":"IF(N5=\"\",\"\",N5*60+O5)","v":237},{"$f":"IF(N5=\"\",\"\",IF(BK5<=Basis!$F$8,0,(BK5-Basis!$F$8)*0.4))","v":6.8000000000000007},{"$f":"IF(N5=\"\",\"\",IF(BK5>Basis!$G$8,0,(Basis!$G$8-BK5)*0.4))","v":0},{"$f":"IF(M5=\"\",\"\",IF(ISTEXT(M5),M5,IF(ISTEXT(P5),P5,M5+P5)))","v":6.8000000000000007},null,24,22.5,{"$f":"IF(BP5=\"\",\"\",BP5/3)","v":8},{"$f":"IF(BQ5=\"\",\"\",BQ5/3)","v":7.5}]
[2,null,33,"741154WP","Liana Peters","Whitney R","RV. Bucephalus",null,200.5,{"$f":"IF(I6=\"\",\"\",IF(ISTEXT(I6),I6,IF(I6<=Basis!$M$8,\"Uit\",(100-(I6/Basis!$L$8*100))*Basis!$Y$6)))","v":33.166666666666671},0,0,0,4,0,{"$f":"IF(N6=\"\",\"\",IF(N6*60+O6>Basis!$U$8,\"Uit\",BL6+BM6))","v":8},null,41.166666666666671,8.5,7,25.666666666666671,"",null,33,0,"-","-","-","-","-","-","-","-","-","-","-","-","-","-","-","-","-",null,null,null,null,null,null,null,0,null,null,33,null,"10:14:00","10:18:00","00:04:00",4,0,null,{"$f":"IF(K6=\"\",\"\",IF(ISTEXT(K6),K6,IF(K6>Basis!$N$8,\"Uit\",IF(ISBLANK(L6),K6,K6+L6))))","v":0},33.166666666666671,240,{"$f":"IF(N6=\"\",\"\",IF(BK6<=Basis!$F$8,0,(BK6-Basis!$F$8)*0.4))","v":8},{"$f":"IF(N6=\"\",\"\",IF(BK6>Basis!$G$8,0,(Basis!$G$8-BK6)*0.4))","v":0},8,null,25.5,21,8.5,7]
[3,null,43,"853705CK","Quirijn Kalkman","Castefield","RV. Door Eenheid Sterk",null,183,{"$f":"IF(I7=\"\",\"\",IF(ISTEXT(I7),I7,IF(I7<=Basis!$M$8,\"Uit\",(100-(I7/Basis!$L$8*100))*Basis!$Y$6)))","v":39},4,0,0,4,12,{"$f":"IF(N7=\"\",\"\",IF(N7*60+O7>Basis!$U$8,\"Uit\",BL7+BM7))","v":12.8},null,55.8,8,6.833333333333333,40.966666666666661,"",null,43,0,"-","-","-","-","-","-","-","-","-","-","-","-","-","-","-","-","-",null,null,null,null,null,null,null,0,null,null,43,null,"10:34:00","10:38:12","00:04:12",4,12,null,{"$f":"IF(K7=\"\",\"\",IF(ISTEXT(K7),K7,IF(K7>Basis!$N$8,\"Uit\",IF(ISBLANK(L7),K7,K7+L7))))","v":4},43,252,{"$f":"IF(N7=\"\",\"\",IF(BK7<=Basis!$F$8,0,(BK7-Basis!$F$8)*0.4))","v":12.8},{"$f":"IF(N7=\"\",\"\",IF(BK7>Basis!$G$8,0,(Basis!$G$8-BK7)*0.4))","v":0},12.8,null,24,20.5,8,6.833333333333333]
[4,null,47,"779101FN","Astrid Nitsch","Fabuleux","RV. Ravensbosch",null,183.5,{"$f":"IF(I8=\"\",\"\",IF(ISTEXT(I8),I8,IF(I8<=Basis!$M$8,\"Uit\",(100-(I8/Basis!$L$8*100))*Basis!$Y$6)))","v":38.833333333333329},8,3,0,4,14,{"$f":"IF(N8=\"\",\"\",IF(N8*60+O8>Basis!$U$8,\"Uit\",BL8+BM8))","v":13.600000000000001},null,63.43333333333333,5.5,6.666666666666667,51.266666666666666,"",null,47,0,"-","-","-","-","-","-","-","-","-","-","-","-","-","-","-","-","-",null,null,null,null,null,null,null,0,null,null,47,null,"10:42:00","10:46:14","00:04:14",4,14,null,{"$f":"IF(K8=\"\",\"\",IF(ISTEXT(K8),K8,IF(K8>Basis!$N$8,\"Uit\",IF(ISBLANK(L8),K8,K8+L8))))","v":11},49.833333333333329,254,{"$f":"IF(N8=\"\",\"\",IF(BK8<=Basis!$F$8,0,(BK8-Basis!$F$8)*0.4))","v":13.600000000000001},{"$f":"IF(N8=\"\",\"\",IF(BK8>Basis!$G$8,0,(Basis!$G$8-BK8)*0.4))","v":0},13.600000000000001,null,16.5,20,5.5,6.666666666666667]
[5,null,61,"728035DB ","Stefanie Baltissen","Diva","RV. Ons Genot",null,178,{"$f":"IF(I9=\"\",\"\",IF(ISTEXT(I9),I9,IF(I9<=Basis!$M$8,\"Uit\",(100-(I9/Basis!$L$8*100))*Basis!$Y$6)))","v":40.666666666666664},4,0,0,5,0,{"$f":"IF(N9=\"\",\"\",IF(N9*60+O9>Basis!$U$8,\"Uit\",BL9+BM9))","v":32},null,76.666666666666657,7.666666666666667,6.333333333333333,62.66666666666665,"",null,61,0,"-","-","-","-","-","-","-","-","-","-","-","-","-","-","-","-","-",null,null,null,null,null,null,null,0,null,null,61,null,"11:10:00","11:15:00","00:05:00",5,0,null,{"$f":"IF(K9=\"\",\"\",IF(ISTEXT(K9),K9,IF(K9>Basis!$N$8,\"Uit\",IF(ISBLANK(L9),K9,K9+L9))))","v":4},44.666666666666664,300,{"$f":"IF(N9=\"\",\"\",IF(BK9<=Basis!$F$8,0,(BK9-Basis!$F$8)*0.4))","v":32},{"$f":"IF(N9=\"\",\"\",IF(BK9>Basis!$G$8,0,(Basis!$G$8-BK9)*0.4))","v":0},32,null,23,19,7.666666666666667,6.333333333333333]
[6,null,53,"Belgie","Jan Willem van Gils","Isvan James VDL",null,null,187.5,{"$f":"IF(I10=\"\",\"\",IF(ISTEXT(I10),I10,IF(I10<=Basis!$M$8,\"Uit\",(100-(I10/Basis!$L$8*100))*Basis!$Y$6)))","v":37.5},0,0,60,6,18,{"$f":"IF(N10=\"\",\"\",IF(N10*60+O10>Basis!$U$8,\"Uit\",BL10+BM10))","v":63.2},null,160.69999999999999,6.666666666666667,6,148.03333333333333,"",null,53,0,"-","-","-","-","-","-",20,"-","-","-",20,"-","-",20,"-","-","-",null,null,null,null,null,null,null,60,null,null,53,null,"10:54:00","11:00:18","00:06:18",6,18,null,{"$f":"IF(K10=\"\",\"\",IF(ISTEXT(K10),K10,IF(K10>Basis!$N$8,\"Uit\",IF(ISBLANK(L10),K10,K10+L10))))","v":0},37.5,378,{"$f":"IF(N10=\"\",\"\",IF(BK10<=Basis!$F$8,0,(BK10-Basis!$F$8)*0.4))","v":63.2},{"$f":"IF(N10=\"\",\"\",IF(BK10>Basis!$G$8,0,(Basis!$G$8-BK10)*0.4))","v":0},123.2,null,20,18,6.666666666666667,6]
[null,null,31,"Belgie","Tanja Wolff","Evert",null,null,199.5,{"$f":"IF(I11=\"\",\"\",IF(ISTEXT(I11),I11,IF(I11<=Basis!$M$8,\"Uit\",(100-(I11/Basis!$L$8*100))*Basis!$Y$6)))","v":33.5},24,36,"NG","","",{"$f":"IF(N11=\"\",\"\",IF(N11*60+O11>Basis!$U$8,\"Uit\",BL11+BM11))","v":""},null,"Uit","","","Uit","",null,31,"NG",null,null,null,null,null,null,null,null,null,null,null,null,null,null,null,null,null,null,null,null,null,null,null,null,"NG",null,null,31,null,"10:10:00",null,"","","",null,{"$f":"IF(K11=\"\",\"\",IF(ISTEXT(K11),K11,IF(K11>Basis!$N$8,\"Uit\",IF(ISBLANK(L11),K11,K11+L11))))","v":"Uit"},"Uit","",{"$f":"IF(N11=\"\",\"\",IF(BK11<=Basis!$F$8,0,(BK11-Basis!$F$8)*0.4))","v":""},{"$f":"IF(N11=\"\",\"\",IF(BK11>Basis!$G$8,0,(Basis!$G$8-BK11)*0.4))","v":""},"NG",null,null,null,"",""]
[null,null,35,"656083CG","Marcel Gulikers","Calimero","RV. Pegasus",null,196.5,{"$f":"IF(I12=\"\",\"\",IF(ISTEXT(I12),I12,IF(I12<=Basis!$M$8,\"Uit\",(100-(I12/Basis!$L$8*100))*Basis!$Y$6)))","v":34.5},0,0,"Uit","","",{"$f":"IF(N12=\"\",\"\",IF(N12*60+O12>Basis!$U$8,\"Uit\",BL12+BM12))","v":""},null,"Uit","","","Uit","VR h.4",null,35,0,"-","-","VR",null,null,null,null,null,null,null,null,null,null,null,null,null,null,null,null,null,null,null,null,null,"Uit","VR h.4",null,35,null,"10:18:00",null,"","","",null,{"$f":"IF(K12=\"\",\"\",IF(ISTEXT(K12),K12,IF(K12>Basis!$N$8,\"Uit\",IF(ISBLANK(L12),K12,K12+L12))))","v":0},34.5,"",{"$f":"IF(N12=\"\",\"\",IF(BK12<=Basis!$F$8,0,(BK12-Basis!$F$8)*0.4))","v":""},{"$f":"IF(N12=\"\",\"\",IF(BK12>Basis!$G$8,0,(Basis!$G$8-BK12)*0.4))","v":""},"Uit",null,null,null,"",""]
[null,null,41,"608758AN","Emma de Nijs","Aglaja","RV. Leveroy",null,201,{"$f":"IF(I13=\"\",\"\",IF(ISTEXT(I13),I13,IF(I13<=Basis!$M$8,\"Uit\",(100-(I13/Basis!$L$8*100))*Basis!$Y$6)))","v":33},0,0,"Uit",5,24,{"$f":"IF(N13=\"\",\"\",IF(N13*60+O13>Basis!$U$8,\"Uit\",BL13+BM13))","v":41.6},null,"Uit",7.5,7,"Uit","FP VD h.9",null,41,20,"-",20,"-","-","-","-","-","-","-","FP","-","-","-","-","-","-","-",null,null,null,null,null,null,null,"Uit","FP VD h.9",null,41,null,"10:30:00","10:35:24","00:05:24",5,24,null,{"$f":"IF(K13=\"\",\"\",IF(ISTEXT(K13),K13,IF(K13>Basis!$N$8,\"Uit\",IF(ISBLANK(L13),K13,K13+L13))))","v":0},33,324,{"$f":"IF(N13=\"\",\"\",IF(BK13<=Basis!$F$8,0,(BK13-Basis!$F$8)*0.4))","v":41.6},{"$f":"IF(N13=\"\",\"\",IF(BK13>Basis!$G$8,0,(Basis!$G$8-BK13)*0.4))","v":0},"Uit",null,22.5,21,7.5,7]
[null,null,45,"848051BW","Michelle Abeling-Willems","Bløf D",null,null,198,{"$f":"IF(I14=\"\",\"\",IF(ISTEXT(I14),I14,IF(I14<=Basis!$M$8,\"Uit\",(100-(I14/Basis!$L$8*100))*Basis!$Y$6)))","v":34},0,0,"Uit",6,3,{"$f":"IF(N14=\"\",\"\",IF(N14*60+O14>Basis!$U$8,\"Uit\",BL14+BM14))","v":57.2},null,"Uit",6,6.333333333333333,"Uit","FP h.4",null,45,20,"-","-","FP","-","-","-","-","-","FP","-","-","-","-","-","-","-","-",null,null,null,null,null,null,null,"Uit","FP h.4",null,45,null,"10:38:00","10:44:03","00:06:03",6,3,null,{"$f":"IF(K14=\"\",\"\",IF(ISTEXT(K14),K14,IF(K14>Basis!$N$8,\"Uit\",IF(ISBLANK(L14),K14,K14+L14))))","v":0},34,363,{"$f":"IF(N14=\"\",\"\",IF(BK14<=Basis!$F$8,0,(BK14-Basis!$F$8)*0.4))","v":57.2},{"$f":"IF(N14=\"\",\"\",IF(BK14>Basis!$G$8,0,(Basis!$G$8-BK14)*0.4))","v":0},"Uit",null,18,19,6,6.333333333333333]
[null,null,55,"807409SP","Joost Pauli","SFS Systems Leonardo Z","RV. Ravensbosch",null,199.5,{"$f":"IF(I15=\"\",\"\",IF(ISTEXT(I15),I15,IF(I15<=Basis!$M$8,\"Uit\",(100-(I15/Basis!$L$8*100))*Basis!$Y$6)))","v":33.5},0,0,"Uit","","",{"$f":"IF(N15=\"\",\"\",IF(N15*60+O15>Basis!$U$8,\"Uit\",BL15+BM15))","v":""},null,"Uit","","","Uit","VR h.9",null,55,0,"-","-","-","-","-","-","-","-","VR",null,null,null,null,null,null,null,null,null,null,null,null,null,null,null,"Uit","VR h.9",null,55,null,"10:58:00",null,"","","",null,{"$f":"IF(K15=\"\",\"\",IF(ISTEXT(K15),K15,IF(K15>Basis!$N$8,\"Uit\",IF(ISBLANK(L15),K15,K15+L15))))","v":0},33.5,"",{"$f":"IF(N15=\"\",\"\",IF(BK15<=Basis!$F$8,0,(BK15-Basis!$F$8)*0.4))","v":""},{"$f":"IF(N15=\"\",\"\",IF(BK15>Basis!$G$8,0,(Basis!$G$8-BK15)*0.4))","v":""},"Uit",null,null,null,"",""]
[null,null,49,"853055CK","Lotte Kersten","Chique Z","RV. Tommix",null,194,{"$f":"IF(I16=\"\",\"\",IF(ISTEXT(I16),I16,IF(I16<=Basis!$M$8,\"Uit\",(100-(I16/Basis!$L$8*100))*Basis!$Y$6)))","v":35.333333333333343},0,0,"NG","","",{"$f":"IF(N16=\"\",\"\",IF(N16*60+O16>Basis!$U$8,\"Uit\",BL16+BM16))","v":""},null,"NG","","","Uit","Vet.spr.",null,49,"NG",null,null,null,null,null,null,null,null,null,null,null,null,null,null,null,null,null,null,null,null,null,null,null,null,{"$f":"IF(Y16=\"\",\"\",IF(ISTEXT(Y16),Y16,SUM(Y16:AW16)))","v":"NG"},"Vet.spr.",null,49,null,"10:46:00",null,"","","",null,{"$f":"IF(K16=\"\",\"\",IF(ISTEXT(K16),K16,IF(K16>Basis!$N$8,\"Uit\",IF(ISBLANK(L16),K16,K16+L16))))","v":0},35.333333333333343,"",{"$f":"IF(N16=\"\",\"\",IF(BK16<=Basis!$F$8,0,(BK16-Basis!$F$8)*0.4))","v":""},{"$f":"IF(N16=\"\",\"\",IF(BK16>Basis!$G$8,0,(Basis!$G$8-BK16)*0.4))","v":""},"NG",null,null,null,"",""]
[null,null,29,"758408CS","Karlijn Scheepens","Cloe Z","RV. Odulphus (pv. Best)",null,"NG",{"$f":"IF(I17=\"\",\"\",IF(ISTEXT(I17),I17,IF(I17<=Basis!$M$8,\"Uit\",(100-(I17/Basis!$L$8*100))*Basis!$Y$6)))","v":"NG"},"NG",null,"NG","","",{"$f":"IF(N17=\"\",\"\",IF(N17*60+O17>Basis!$U$8,\"Uit\",BL17+BM17))","v":""},null,"NG","","",{"$f":"IF(R17=\"\",\"\",IF(ISTEXT(R17),R17,IF(BP17=\"\",\"\",R17-S17-T17)))","v":"NG"},"",null,29,"NG",null,null,null,null,null,null,null,null,null,null,null,null,null,null,null,null,null,null,null,null,null,null,null,null,"NG",null,null,29,null,"10:06:00",null,"","","",null,{"$f":"IF(K17=\"\",\"\",IF(ISTEXT(K17),K17,IF(K17>Basis!$N$8,\"Uit\",IF(ISBLANK(L17),K17,K17+L17))))","v":"NG"},"NG","",{"$f":"IF(N17=\"\",\"\",IF(BK17<=Basis!$F$8,0,(BK17-Basis!$F$8)*0.4))","v":""},{"$f":"IF(N17=\"\",\"\",IF(BK17>Basis!$G$8,0,(Basis!$G$8-BK17)*0.4))","v":""},"NG",null,null,null,"",""]
[null,null,57,"785148GB","Bella van den Borch","Guillietta W","RV. St. Steffenrijders",null,"NG",{"$f":"IF(I18=\"\",\"\",IF(ISTEXT(I18),I18,IF(I18<=Basis!$M$8,\"Uit\",(100-(I18/Basis!$L$8*100))*Basis!$Y$6)))","v":"NG"},"NG",null,{"$f":"IF(AX18=\"\",\"\",AX18)","v":"NG"},"","",{"$f":"IF(N18=\"\",\"\",IF(N18*60+O18>Basis!$U$8,\"Uit\",BL18+BM18))","v":""},null,"NG","","",{"$f":"IF(R18=\"\",\"\",IF(ISTEXT(R18),R18,IF(BP18=\"\",\"\",R18-S18-T18)))","v":"NG"},"",null,57,"NG",null,null,null,null,null,null,null,null,null,null,null,null,null,null,null,null,null,null,null,null,null,null,null,null,"NG",null,null,57,null,"11:02:00",null,"","","",null,{"$f":"IF(K18=\"\",\"\",IF(ISTEXT(K18),K18,IF(K18>Basis!$N$8,\"Uit\",IF(ISBLANK(L18),K18,K18+L18))))","v":"NG"},"NG","",{"$f":"IF(N18=\"\",\"\",IF(BK18<=Basis!$F$8,0,(BK18-Basis!$F$8)*0.4))","v":""},{"$f":"IF(N18=\"\",\"\",IF(BK18>Basis!$G$8,0,(Basis!$G$8-BK18)*0.4))","v":""},"NG",null,null,null,"",""]
[null,null,null,null,null,null,null,null,null,{"$f":"IF(I19=\"\",\"\",IF(ISTEXT(I19),I19,IF(I19<=Basis!$M$8,\"Uit\",(100-(I19/Basis!$L$8*100))*Basis!$Y$6)))","v":""},null,null,{"$f":"IF(AX19=\"\",\"\",AX19)","v":""},"","",{"$f":"IF(N19=\"\",\"\",IF(N19*60+O19>Basis!$U$8,\"Uit\",BL19+BM19))","v":""},null,"","","",{"$f":"IF(R19=\"\",\"\",IF(ISTEXT(R19),R19,IF(BP19=\"\",\"\",R19-S19-T19)))","v":""},"",null,"",null,null,null,null,null,null,null,null,null,null,null,null,null,null,null,null,null,null,null,null,null,null,null,null,null,"",null,null,"",null,null,null,"","","",null,{"$f":"IF(K19=\"\",\"\",IF(ISTEXT(K19),K19,IF(K19>Basis!$N$8,\"Uit\",IF(ISBLANK(L19),K19,K19+L19))))","v":""},"","",{"$f":"IF(N19=\"\",\"\",IF(BK19<=Basis!$F$8,0,(BK19-Basis!$F$8)*0.4))","v":""},{"$f":"IF(N19=\"\",\"\",IF(BK19>Basis!$G$8,0,(Basis!$G$8-BK19)*0.4))","v":""},"",null,null,null,"",""]
[null,null,null,null,null,null,null,null,null,{"$f":"IF(I20=\"\",\"\",IF(ISTEXT(I20),I20,IF(I20<=Basis!$M$8,\"Uit\",(100-(I20/Basis!$L$8*100))*Basis!$Y$6)))","v":""},null,null,{"$f":"IF(AX20=\"\",\"\",AX20)","v":""},"","",{"$f":"IF(N20=\"\",\"\",IF(N20*60+O20>Basis!$U$8,\"Uit\",BL20+BM20))","v":""},null,"","","",{"$f":"IF(R20=\"\",\"\",IF(ISTEXT(R20),R20,IF(BP20=\"\",\"\",R20-S20-T20)))","v":""},"",null,"",null,null,null,null,null,null,null,null,null,null,null,null,null,null,null,null,null,null,null,null,null,null,null,null,null,"",null,null,"",null,null,null,"","","",null,{"$f":"IF(K20=\"\",\"\",IF(ISTEXT(K20),K20,IF(K20>Basis!$N$8,\"Uit\",IF(ISBLANK(L20),K20,K20+L20))))","v":""},"","",{"$f":"IF(N20=\"\",\"\",IF(BK20<=Basis!$F$8,0,(BK20-Basis!$F$8)*0.4))","v":""},{"$f":"IF(N20=\"\",\"\",IF(BK20>Basis!$G$8,0,(Basis!$G$8-BK20)*0.4))","v":""},"",null,null,null,"",""]
[null,null,null,null,null,null,null,null,null,{"$f":"IF(I21=\"\",\"\",IF(ISTEXT(I21),I21,IF(I21<=Basis!$M$8,\"Uit\",(100-(I21/Basis!$L$8*100))*Basis!$Y$6)))","v":""},null,null,{"$f":"IF(AX21=\"\",\"\",AX21)","v":""},"","",{"$f":"IF(N21=\"\",\"\",IF(N21*60+O21>Basis!$U$8,\"Uit\",BL21+BM21))","v":""},null,"","","",{"$f":"IF(R21=\"\",\"\",IF(ISTEXT(R21),R21,IF(BP21=\"\",\"\",R21-S21-T21)))","v":""},"",null,"",null,null,null,null,null,null,null,null,null,null,null,null,null,null,null,null,null,null,null,null,null,null,null,null,null,"",null,null,"",null,null,null,"","","",null,{"$f":"IF(K21=\"\",\"\",IF(ISTEXT(K21),K21,IF(K21>Basis!$N$8,\"Uit\",IF(ISBLANK(L21),K21,K21+L21))))","v":""},"","",{"$f":"IF(N21=\"\",\"\",IF(BK21<=Basis!$F$8,0,(BK21-Basis!$F$8)*0.4))","v":""},{"$f":"IF(N21=\"\",\"\",IF(BK21>Basis!$G$8,0,(Basis!$G$8-BK21)*0.4))","v":""},"",null,null,null,"",""]
[null,null,null,null,null,null,null,null,null,{"$f":"IF(I22=\"\",\"\",IF(ISTEXT(I22),I22,IF(I22<=Basis!$M$8,\"Uit\",(100-(I22/Basis!$L$8*100))*Basis!$Y$6)))","v":""},null,null,{"$f":"IF(AX22=\"\",\"\",AX22)","v":""},{"$f":"IF(ISBLANK(BD22),\"\",BF22)","v":""},{"$f":"IF(ISBLANK(BD22),\"\",BG22)","v":""},{"$f":"IF(N22=\"\",\"\",IF(N22*60+O22>Basis!$U$8,\"Uit\",BL22+BM22))","v":""},null,{"$f":"IF(ISTEXT(BJ22),BJ22,IF(OR(ISBLANK(M22),M22=\"\",ISBLANK(Y22)),BJ22,IF(ISTEXT(BN22),BN22,BJ22+BN22)))","v":""},{"$f":"IF(BP22=\"\",\"\",BR22)","v":""},"",{"$f":"IF(R22=\"\",\"\",IF(ISTEXT(R22),R22,IF(BP22=\"\",\"\",R22-S22-T22)))","v":""},{"$f":"IF(AY22=\"\",\"\",AY22)","v":""},null,"",null,null,null,null,null,null,null,null,null,null,null,null,null,null,null,null,null,null,null,null,null,null,null,null,null,{"$f":"IF(Y22=\"\",\"\",IF(ISTEXT(Y22),Y22,SUM(Y22:AW22)))","v":""},null,null,"",null,null,null,{"$f":"IF(ISBLANK(BD22),\"\",BD22-BC22)","v":""},{"$f":"IF(ISBLANK(BD22),\"\",MINUTE(BE22))","v":""},{"$f":"IF(ISBLANK(BD22),\"\",SECOND(BE22))","v":""},null,{"$f":"IF(K22=\"\",\"\",IF(ISTEXT(K22),K22,IF(K22>Basis!$N$8,\"Uit\",IF(ISBLANK(L22),K22,K22+L22))))","v":""},{"$f":"IF(OR(ISTEXT(J22),BI22=\"\"),J22,IF(ISTEXT(BI22),BI22,J22+BI22))","v":""},{"$f":"IF(N22=\"\",\"\",N22*60+O22)","v":""},{"$f":"IF(N22=\"\",\"\",IF(BK22<=Basis!$F$8,0,(BK22-Basis!$F$8)*0.4))","v":""},{"$f":"IF(N22=\"\",\"\",IF(BK22>Basis!$G$8,0,(Basis!$G$8-BK22)*0.4))","v":""},{"$f":"IF(M22=\"\",\"\",IF(ISTEXT(M22),M22,IF(ISTEXT(P22),P22,M22+P22)))","v":""},null,null,null,{"$f":"IF(BP22=\"\",\"\",BP22/3)","v":""},""]
["  Bij uitsluiting reden vermelden : ",null,null,null,null,null,null,null,null,null,null,null,null,null,null,{"$f":"NOW()","v":"2018-06-30T22:02:24.880"},null,null,null,null,null,null,null,{"$f":"A23","v":"  Bij uitsluiting reden vermelden : "},null,null,null,null,null,null,null,null,null,null,null,null,null,null,null,null,null,null,null,null,null,null,{"$f":"NOW()","v":"2018-06-30T22:02:24.880"}]
["  VP=val paard, VR=val ruiter, 3W=3 weigeringen op zelfde hindernis, 4W=4 weigeringen totaal, FP=foutief parcours, Vr.v= vrijwillig verlaten",null,null,null,null,null,null,null,null,null,null,null,null,null,null,null,null,null,null,null,null,null,null,{"$f":"A24","v":"  VP=val paard, VR=val ruiter, 3W=3 weigeringen op zelfde hindernis, 4W=4 weigeringen totaal, FP=foutief parcours, Vr.v= vrijwillig verlaten"}]

{"sheet":"Ring 3 - Lpaarden","index":7,"n_rows":32,"n_cols":66,"rows_kept":32,"cut":false,"hidden":false,"merged":[[2,13,2,14],[30,15,30,21],[30,46,30,52],[1,7,1,8]]}
[{"$f":"\" Samengestelde wedstrijd \"&Basis!D5","v":" Samengestelde wedstrijd Eventing Leende 30 juni 2018"},null,null,null,null,null,"Klasse L paarden - Ring 3",null,null,null,"Dressuurjury : ","Doortje Herk",null,null,null,null,null,null,null,null,null,null,null," Verzamelstaat hindernisfouten in de cross",null,null,null,null,null,null,null,null,null,null,null,null,{"$f":"A1","v":" Samengestelde wedstrijd Eventing Leende 30 juni 2018"},null,null,null,null,null,null,null,null,null,null,null,null,null,null,null,{"$f":"G1&\" \"","v":"Klasse L paarden - Ring 3 "},null," Indien aankomstUUR cross wordt meegedeeld :",null,null,null,null,null," Hulpkolommen"]
["rank",null,"rugnr","combinatie nr","naam ruiter","naam paard","vereniging / plaats","dressuur",null,"dressuur","hind.ft.","tijd.ft.","hind.ft.","min","sec","tijd.ft.",null,"totaal","(1) stijl","(2) stijl","eind-","reden",null,null,"hindernisnummer",null,null,null,null,null,null,null,null,null,null,null,null,null,null,null,null,null,null,null,null,null,null,null,null,null," ",null,null,null,null,null,null,null,null,null,"Uitslag","NA","tijd (sec)","tijd.ft.","reg.ft.","totaal"]
["HC",null,null,null,null,null,null,"Jury C","Jury 2","strafpntn.","springen","springen","cross","cross",null,{"$f":"Basis!$H$9&\":\"&TEXT(Basis!$I$9,\"00\")","v":"4:15"},null,null,"cijfer","cijfer","totaal","uitsluiting",null,"nr",1,2,3,"4ab",5,6,7,8,9,10,11,12,13,14,15,"VD","16ab","VD",17,18,19,"F",null,null,null,"totaal","reden uitsluiting","hind.","nr",null,"Vertrekuur","Aankomst","Tijd","Minuten","Seconden",null,"Springen","Springen","cross","opt.tijd =",{"$f":"Basis!$H$9&\":\"&TEXT(Basis!$I$9,\"00\")","v":"4:15"},"cross"]
[null,null,null,null,null,null,null,null,null,null,null,null,null,null,null,null,null,{"$f":"IF(ISBLANK(I4),\"\",IF(AND(ISBLANK(K4),ISBLANK(Y4)),J4,IF(ISTEXT(K4),K4,IF(OR(ISBLANK(M4),M4=\"\"),J4+K4+L4,IF(ISTEXT(M4),M4,IF(ISBLANK(Y4),J4+K4+L4,J4+K4+L4+M4+P4+Q4))))))","v":""}]
[1,null,63,"784137GB","Geesje Burema","Ginante di Calvino ","RV. Heeze (rsv.)",174,174,{"$f":"IF(H5=\"\",\"\",IF(ISTEXT(H5),H5,IF(I5=\"\",\"\",IF((H5+I5)/2<=Basis!$M$9,\"Uit\",(100-((H5+I5)/2/Basis!$L$9*100))*Basis!$Y$6))))","v":42.000000000000007},0,0,{"$f":"IF(AX5=\"\",\"\",AX5)","v":0},{"$f":"IF(ISBLANK(BD5),\"\",BF5)","v":4},{"$f":"IF(ISBLANK(BD5),\"\",BG5)","v":11},{"$f":"IF(N5=\"\",\"\",IF(N5*60+O5>Basis!$U$9,\"Uit\",BL5+BM5))","v":0},null,{"$f":"IF(ISTEXT(BJ5),BJ5,IF(OR(ISBLANK(M5),M5=\"\",ISBLANK(Y5)),BJ5,IF(ISTEXT(BN5),BN5,BJ5+BN5)))","v":42.000000000000007},null,null,{"$f":"IF(R5=\"\",\"\",IF(ISTEXT(R5),R5,R5-S5-T5))","v":42.000000000000007},{"$f":"IF(AY5=\"\",\"\",AY5)","v":""},null,{"$f":"IF($C5=\"\",\"\",$C5)","v":63},0,"-","-","-","-","-","-","-","-","-","-","-","-","-","-","-","-","-","-","-","-","-",null,null,null,{"$f":"IF(Y5=\"\",\"\",IF(ISTEXT(Y5),Y5,SUM(Y5:AW5)))","v":0},null,null,{"$f":"IF($C5=\"\",\"\",$C5)","v":63},null,"11:30:00","11:34:11",{"$f":"IF(ISBLANK(BD5),\"\",BD5-BC5)","v":"00:04:11"},{"$f":"IF(ISBLANK(BD5),\"\",MINUTE(BE5))","v":4},{"$f":"IF(ISBLANK(BD5),\"\",SECOND(BE5))","v":11},null,{"$f":"IF(K5=\"\",\"\",IF(ISTEXT(K5),K5,IF(K5>Basis!$N$9,\"Uit\",IF(ISBLANK(L5),K5,K5+L5))))","v":0},{"$f":"IF(OR(ISTEXT(J5),BI5=\"\"),J5,IF(ISTEXT(BI5),BI5,J5+BI5))","v":42.000000000000007},{"$f":"IF(N5=\"\",\"\",N5*60+O5)","v":251},{"$f":"IF(N5=\"\",\"\",IF(BK5<=Basis!$F$9,0,(BK5-Basis!$F$9)*0.4))","v":0},{"$f":"IF(N5=\"\",\"\",IF(BK5>Basis!$G$9,0,(Basis!$G$9-BK5)*0.4))","v":0},{"$f":"IF(M5=\"\",\"\",IF(ISTEXT(M5),M5,IF(ISTEXT(P5),P5,M5+P5)))","v":0}]
[2,null,71,"774900FP","Willemijn Poetsma","Miss mc Flurrie","RV. Paddock",196,196,{"$f":"IF(H6=\"\",\"\",IF(ISTEXT(H6),H6,IF(I6=\"\",\"\",IF((H6+I6)/2<=Basis!$M$9,\"Uit\",(100-((H6+I6)/2/Basis!$L$9*100))*Basis!$Y$6))))","v":34.666666666666671},4,0,0,4,28,{"$f":"IF(N6=\"\",\"\",IF(N6*60+O6>Basis!$U$9,\"Uit\",BL6+BM6))","v":5.2},null,43.866666666666674,null,null,43.866666666666674,"",null,71,0,"-","-","-","-","-","-","-","-","-","-","-","-","-","-","-","-","-","-","-","-","-",null,null,null,0,null,null,71,null,"11:46:00","11:50:28","00:04:28",4,28,null,{"$f":"IF(K6=\"\",\"\",IF(ISTEXT(K6),K6,IF(K6>Basis!$N$9,\"Uit\",IF(ISBLANK(L6),K6,K6+L6))))","v":4},38.666666666666671,268,{"$f":"IF(N6=\"\",\"\",IF(BK6<=Basis!$F$9,0,(BK6-Basis!$F$9)*0.4))","v":5.2},{"$f":"IF(N6=\"\",\"\",IF(BK6>Basis!$G$9,0,(Basis!$G$9-BK6)*0.4))","v":0},5.2]
[3,null,65,"855906HP","Mythe Panman","Hernán Termo",null,210,210,{"$f":"IF(H7=\"\",\"\",IF(ISTEXT(H7),H7,IF(I7=\"\",\"\",IF((H7+I7)/2<=Basis!$M$9,\"Uit\",(100-((H7+I7)/2/Basis!$L$9*100))*Basis!$Y$6))))","v":30},0,0,0,4,56,{"$f":"IF(N7=\"\",\"\",IF(N7*60+O7>Basis!$U$9,\"Uit\",BL7+BM7))","v":16.400000000000002},null,46.400000000000006,null,null,46.400000000000006,"",null,65,0,"-","-","-","-","-","-","-","-","-","-","-","-","-","-","-","-","-","-","-","-","-",null,null,null,0,null,null,65,null,"11:34:00","11:38:56","00:04:56",4,56,null,{"$f":"IF(K7=\"\",\"\",IF(ISTEXT(K7),K7,IF(K7>Basis!$N$9,\"Uit\",IF(ISBLANK(L7),K7,K7+L7))))","v":0},30,296,{"$f":"IF(N7=\"\",\"\",IF(BK7<=Basis!$F$9,0,(BK7-Basis!$F$9)*0.4))","v":16.400000000000002},{"$f":"IF(N7=\"\",\"\",IF(BK7>Basis!$G$9,0,(Basis!$G$9-BK7)*0.4))","v":0},16.400000000000002]
[4,null,93,"744312FV","Niels van Vlerken","Formidable","RV. Equinus Stramproy",179,179,{"$f":"IF(H8=\"\",\"\",IF(ISTEXT(H8),H8,IF(I8=\"\",\"\",IF((H8+I8)/2<=Basis!$M$9,\"Uit\",(100-((H8+I8)/2/Basis!$L$9*100))*Basis!$Y$6))))","v":40.333333333333329},8,4,0,4,15,{"$f":"IF(N8=\"\",\"\",IF(N8*60+O8>Basis!$U$9,\"Uit\",BL8+BM8))","v":0},null,52.333333333333329,null,null,52.333333333333329,"",null,93,0,"-","-","-","-","-","-","-","-","-","-","-","-","-","-","-","-","-","-","-","-","-",null,null,null,0,null,null,93,null,"13:08:00","13:12:15","00:04:15",4,15,null,{"$f":"IF(K8=\"\",\"\",IF(ISTEXT(K8),K8,IF(K8>Basis!$N$9,\"Uit\",IF(ISBLANK(L8),K8,K8+L8))))","v":12},52.333333333333329,255,{"$f":"IF(N8=\"\",\"\",IF(BK8<=Basis!$F$9,0,(BK8-Basis!$F$9)*0.4))","v":0},{"$f":"IF(N8=\"\",\"\",IF(BK8>Basis!$G$9,0,(Basis!$G$9-BK8)*0.4))","v":0},0]
[5,null,75,"835389HW","Kim van der Woude","Hint C","RV. Groenewoude",178.5,178.5,{"$f":"IF(H9=\"\",\"\",IF(ISTEXT(H9),H9,IF(I9=\"\",\"\",IF((H9+I9)/2<=Basis!$M$9,\"Uit\",(100-((H9+I9)/2/Basis!$L$9*100))*Basis!$Y$6))))","v":40.5},4,0,0,4,40,{"$f":"IF(N9=\"\",\"\",IF(N9*60+O9>Basis!$U$9,\"Uit\",BL9+BM9))","v":10},null,54.5,null,null,54.5,"",null,75,0,"-","-","-","-","-","-","-","-","-","-","-","-","-","-","-","-","-","-","-","-","-",null,null,null,0,null,null,75,null,"12:32:00","12:36:40","00:04:40",4,40,null,{"$f":"IF(K9=\"\",\"\",IF(ISTEXT(K9),K9,IF(K9>Basis!$N$9,\"Uit\",IF(ISBLANK(L9),K9,K9+L9))))","v":4},44.5,280,{"$f":"IF(N9=\"\",\"\",IF(BK9<=Basis!$F$9,0,(BK9-Basis!$F$9)*0.4))","v":10},{"$f":"IF(N9=\"\",\"\",IF(BK9>Basis!$G$9,0,(Basis!$G$9-BK9)*0.4))","v":0},10]
[6,null,73,"667113PV","Colet van Vliet","Pelle","RV. de Voornruiters",160.5,160.5,{"$f":"IF(H10=\"\",\"\",IF(ISTEXT(H10),H10,IF(I10=\"\",\"\",IF((H10+I10)/2<=Basis!$M$9,\"Uit\",(100-((H10+I10)/2/Basis!$L$9*100))*Basis!$Y$6))))","v":46.5},0,0,0,4,37,{"$f":"IF(N10=\"\",\"\",IF(N10*60+O10>Basis!$U$9,\"Uit\",BL10+BM10))","v":8.8000000000000007},null,55.3,null,null,55.3,"",null,73,0,"-","-","-","-","-","-","-","-","-","-","-","-","-","-","-","-","-","-","-","-","-",null,null,null,0,null,null,73,null,"11:50:00","11:54:37","00:04:37",4,37,null,{"$f":"IF(K10=\"\",\"\",IF(ISTEXT(K10),K10,IF(K10>Basis!$N$9,\"Uit\",IF(ISBLANK(L10),K10,K10+L10))))","v":0},46.5,277,{"$f":"IF(N10=\"\",\"\",IF(BK10<=Basis!$F$9,0,(BK10-Basis!$F$9)*0.4))","v":8.8000000000000007},{"$f":"IF(N10=\"\",\"\",IF(BK10>Basis!$G$9,0,(Basis!$G$9-BK10)*0.4))","v":0},8.8000000000000007]
[7,null,94,"698149FO","Anne Olfers","Frescobaldi","RV. Drie Beerzen",193.5,193.5,{"$f":"IF(H11=\"\",\"\",IF(ISTEXT(H11),H11,IF(I11=\"\",\"\",IF((H11+I11)/2<=Basis!$M$9,\"Uit\",(100-((H11+I11)/2/Basis!$L$9*100))*Basis!$Y$6))))","v":35.5},0,0,0,5,6,{"$f":"IF(N11=\"\",\"\",IF(N11*60+O11>Basis!$U$9,\"Uit\",BL11+BM11))","v":20.400000000000002},null,55.900000000000006,null,null,55.900000000000006,"",null,94,0,"-","-","-","-","-","-","-","-","-","-","-","-","-","-","-","-","-","-","-","-","-",null,null,null,0,null,null,94,null,"13:10:00","13:15:06","00:05:06",5,6,null,{"$f":"IF(K11=\"\",\"\",IF(ISTEXT(K11),K11,IF(K11>Basis!$N$9,\"Uit\",IF(ISBLANK(L11),K11,K11+L11))))","v":0},35.5,306,{"$f":"IF(N11=\"\",\"\",IF(BK11<=Basis!$F$9,0,(BK11-Basis!$F$9)*0.4))","v":20.400000000000002},{"$f":"IF(N11=\"\",\"\",IF(BK11>Basis!$G$9,0,(Basis!$G$9-BK11)*0.4))","v":0},20.400000000000002]
[8,null,77,"856226GH","Sterre van Houte","G Star",null,162,162,{"$f":"IF(H12=\"\",\"\",IF(ISTEXT(H12),H12,IF(I12=\"\",\"\",IF((H12+I12)/2<=Basis!$M$9,\"Uit\",(100-((H12+I12)/2/Basis!$L$9*100))*Basis!$Y$6))))","v":46},0,0,0,5,7,{"$f":"IF(N12=\"\",\"\",IF(N12*60+O12>Basis!$U$9,\"Uit\",BL12+BM12))","v":20.8},null,66.8,null,null,66.8,"",null,77,0,"-","-","-","-","-","-","-","-","-","-","-","-","-","-","-","-","-","-","-","-","-",null,null,null,0,null,null,77,null,"12:36:00","12:41:07","00:05:07",5,7,null,{"$f":"IF(K12=\"\",\"\",IF(ISTEXT(K12),K12,IF(K12>Basis!$N$9,\"Uit\",IF(ISBLANK(L12),K12,K12+L12))))","v":0},46,307,{"$f":"IF(N12=\"\",\"\",IF(BK12<=Basis!$F$9,0,(BK12-Basis!$F$9)*0.4))","v":20.8},{"$f":"IF(N12=\"\",\"\",IF(BK12>Basis!$G$9,0,(Basis!$G$9-BK12)*0.4))","v":0},20.8]
[9,null,80,"750544BJ","Iris Janssen","Barilla","RV. Zeldenrust",191.5,191.5,{"$f":"IF(H13=\"\",\"\",IF(ISTEXT(H13),H13,IF(I13=\"\",\"\",IF((H13+I13)/2<=Basis!$M$9,\"Uit\",(100-((H13+I13)/2/Basis!$L$9*100))*Basis!$Y$6))))","v":36.166666666666671},0,0,20,4,45,{"$f":"IF(N13=\"\",\"\",IF(N13*60+O13>Basis!$U$9,\"Uit\",BL13+BM13))","v":12},null,68.166666666666671,null,null,68.166666666666671,"",null,80,0,"-","-","-","-","-","-","-",20,"-","-","-","-","-","-","-","-","-","-","-","-","-",null,null,null,20,null,null,80,null,"12:42:00","12:46:45","00:04:45",4,45,null,{"$f":"IF(K13=\"\",\"\",IF(ISTEXT(K13),K13,IF(K13>Basis!$N$9,\"Uit\",IF(ISBLANK(L13),K13,K13+L13))))","v":0},36.166666666666671,285,{"$f":"IF(N13=\"\",\"\",IF(BK13<=Basis!$F$9,0,(BK13-Basis!$F$9)*0.4))","v":12},{"$f":"IF(N13=\"\",\"\",IF(BK13>Basis!$G$9,0,(Basis!$G$9-BK13)*0.4))","v":0},32]
[10,null,86,"849985BW","Alessandra Wiezer","Bellissima","RV. Laar",195.5,195.5,{"$f":"IF(H14=\"\",\"\",IF(ISTEXT(H14),H14,IF(I14=\"\",\"\",IF((H14+I14)/2<=Basis!$M$9,\"Uit\",(100-((H14+I14)/2/Basis!$L$9*100))*Basis!$Y$6))))","v":34.833333333333343},0,0,20,4,53,{"$f":"IF(N14=\"\",\"\",IF(N14*60+O14>Basis!$U$9,\"Uit\",BL14+BM14))","v":15.200000000000001},null,70.033333333333346,null,null,70.033333333333346,"",null,86,0,"-","-",20,"-","-","-","-","-","-","-","-","-","-","-","-","-","-","-","-","-","-",null,null,null,20,null,null,86,null,"12:54:00","12:58:53","00:04:53",4,53,null,{"$f":"IF(K14=\"\",\"\",IF(ISTEXT(K14),K14,IF(K14>Basis!$N$9,\"Uit\",IF(ISBLANK(L14),K14,K14+L14))))","v":0},34.833333333333343,293,{"$f":"IF(N14=\"\",\"\",IF(BK14<=Basis!$F$9,0,(BK14-Basis!$F$9)*0.4))","v":15.200000000000001},{"$f":"IF(N14=\"\",\"\",IF(BK14>Basis!$G$9,0,(Basis!$G$9-BK14)*0.4))","v":0},35.200000000000003]
[11,null,67,"841391IB","Lilian Bakker","Ivy M","Manege De Hoef V.O.F.",158.5,158.5,{"$f":"IF(H15=\"\",\"\",IF(ISTEXT(H15),H15,IF(I15=\"\",\"\",IF((H15+I15)/2<=Basis!$M$9,\"Uit\",(100-((H15+I15)/2/Basis!$L$9*100))*Basis!$Y$6))))","v":47.166666666666671},8,0,20,5,50,{"$f":"IF(N15=\"\",\"\",IF(N15*60+O15>Basis!$U$9,\"Uit\",BL15+BM15))","v":38},null,113.16666666666667,null,null,113.16666666666667,"",null,67,0,"-","-","-","-","-","-","-","-","-","-","-","-","-","-","-",20,"-","-","-","-","-",null,null,null,20,null,null,67,null,"11:38:00","11:43:50","00:05:50",5,50,null,{"$f":"IF(K15=\"\",\"\",IF(ISTEXT(K15),K15,IF(K15>Basis!$N$9,\"Uit\",IF(ISBLANK(L15),K15,K15+L15))))","v":8},55.166666666666671,350,{"$f":"IF(N15=\"\",\"\",IF(BK15<=Basis!$F$9,0,(BK15-Basis!$F$9)*0.4))","v":38},{"$f":"IF(N15=\"\",\"\",IF(BK15>Basis!$G$9,0,(Basis!$G$9-BK15)*0.4))","v":0},58]
[12,null,92,"726098JB","Nikki van den Berg","Joya di Unaniem","RV. De Kleine Heraut (rsv.)",170,170,{"$f":"IF(H16=\"\",\"\",IF(ISTEXT(H16),H16,IF(I16=\"\",\"\",IF((H16+I16)/2<=Basis!$M$9,\"Uit\",(100-((H16+I16)/2/Basis!$L$9*100))*Basis!$Y$6))))","v":43.333333333333336},0,0,80,5,17,{"$f":"IF(N16=\"\",\"\",IF(N16*60+O16>Basis!$U$9,\"Uit\",BL16+BM16))","v":24.8},null,148.13333333333333,null,null,148.13333333333333,"",null,92,0,"-","-",20,"-","-","-","-",60,"-","-","-","-","-","-","-","-","-","-","-","-","-",null,null,null,80,null,null,92,null,"13:06:00","13:11:17","00:05:17",5,17,null,{"$f":"IF(K16=\"\",\"\",IF(ISTEXT(K16),K16,IF(K16>Basis!$N$9,\"Uit\",IF(ISBLANK(L16),K16,K16+L16))))","v":0},43.333333333333336,317,{"$f":"IF(N16=\"\",\"\",IF(BK16<=Basis!$F$9,0,(BK16-Basis!$F$9)*0.4))","v":24.8},{"$f":"IF(N16=\"\",\"\",IF(BK16>Basis!$G$9,0,(Basis!$G$9-BK16)*0.4))","v":0},104.8]
[null,null,82,"824447DV","Jantina Vos","Dior","Manege De Hoef V.O.F.",130,130,{"$f":"IF(H17=\"\",\"\",IF(ISTEXT(H17),H17,IF(I17=\"\",\"\",IF((H17+I17)/2<=Basis!$M$9,\"Uit\",(100-((H17+I17)/2/Basis!$L$9*100))*Basis!$Y$6))))","v":"Uit"},"NG",null,"NG","","",{"$f":"IF(N17=\"\",\"\",IF(N17*60+O17>Basis!$U$9,\"Uit\",BL17+BM17))","v":""},null,"Uit",null,null,"Uit","Uit dr.",null,82,"NG",null,null,null,null,null,null,null,null,null,null,null,null,null,null,null,null,null,null,null,null,null,null,null,null,"NG",null,null,82,null,"12:46:00",null,"","","",null,{"$f":"IF(K17=\"\",\"\",IF(ISTEXT(K17),K17,IF(K17>Basis!$N$9,\"Uit\",IF(ISBLANK(L17),K17,K17+L17))))","v":"NG"},"Uit","",{"$f":"IF(N17=\"\",\"\",IF(BK17<=Basis!$F$9,0,(BK17-Basis!$F$9)*0.4))","v":""},{"$f":"IF(N17=\"\",\"\",IF(BK17>Basis!$G$9,0,(Basis!$G$9-BK17)*0.4))","v":""},"NG"]
[null,null,84,"677482CD","Sharon van Daal","Cumlaude","RV. Peelrossen",209.5,209.5,{"$f":"IF(H18=\"\",\"\",IF(ISTEXT(H18),H18,IF(I18=\"\",\"\",IF((H18+I18)/2<=Basis!$M$9,\"Uit\",(100-((H18+I18)/2/Basis!$L$9*100))*Basis!$Y$6))))","v":30.166666666666657},0,0,"Uit",4,18,{"$f":"IF(N18=\"\",\"\",IF(N18*60+O18>Basis!$U$9,\"Uit\",BL18+BM18))","v":1.2000000000000002},null,"Uit",null,null,"Uit",{"$f":"IF(AY18=\"\",\"\",AY18)","v":"FP h.16"},null,84,0,"-","-","-","-","-","-","-","-","-","-","-","-","-","-","-","FP","-","-","-","-","-",null,null,null,"Uit","FP h.16",null,84,null,"12:50:00","12:54:18","00:04:18",4,18,null,{"$f":"IF(K18=\"\",\"\",IF(ISTEXT(K18),K18,IF(K18>Basis!$N$9,\"Uit\",IF(ISBLANK(L18),K18,K18+L18))))","v":0},30.166666666666657,258,{"$f":"IF(N18=\"\",\"\",IF(BK18<=Basis!$F$9,0,(BK18-Basis!$F$9)*0.4))","v":1.2000000000000002},{"$f":"IF(N18=\"\",\"\",IF(BK18>Basis!$G$9,0,(Basis!$G$9-BK18)*0.4))","v":0},"Uit"]
[null,null,89,"625894BB","Linda de Beukelaer","Banksy","RV. Roerstreek",197,197,{"$f":"IF(H19=\"\",\"\",IF(ISTEXT(H19),H19,IF(I19=\"\",\"\",IF((H19+I19)/2<=Basis!$M$9,\"Uit\",(100-((H19+I19)/2/Basis!$L$9*100))*Basis!$Y$6))))","v":34.333333333333343},0,0,"Uit","","",{"$f":"IF(N19=\"\",\"\",IF(N19*60+O19>Basis!$U$9,\"Uit\",BL19+BM19))","v":""},null,"Uit",null,null,"Uit",{"$f":"IF(AY19=\"\",\"\",AY19)","v":"VP h.14"},null,89,0,"-","-","-","-","-","-","-","-","-","-","-","-","VP","-","-",null,null,null,null,null,null,null,null,null,"Uit","VP h.14",null,89,null,"13:00:00",null,"","","",null,{"$f":"IF(K19=\"\",\"\",IF(ISTEXT(K19),K19,IF(K19>Basis!$N$9,\"Uit\",IF(ISBLANK(L19),K19,K19+L19))))","v":0},34.333333333333343,"",{"$f":"IF(N19=\"\",\"\",IF(BK19<=Basis!$F$9,0,(BK19-Basis!$F$9)*0.4))","v":""},{"$f":"IF(N19=\"\",\"\",IF(BK19>Basis!$G$9,0,(Basis!$G$9-BK19)*0.4))","v":""},"Uit"]
[null,null,95,"818502CJ","Chris Jordans","Carlos","RV. Equitania","Uit","Uit",{"$f":"IF(H20=\"\",\"\",IF(ISTEXT(H20),H20,IF(I20=\"\",\"\",IF((H20+I20)/2<=Basis!$M$9,\"Uit\",(100-((H20+I20)/2/Basis!$L$9*100))*Basis!$Y$6))))","v":"Uit"},"NG",null,"NG","","",{"$f":"IF(N20=\"\",\"\",IF(N20*60+O20>Basis!$U$9,\"Uit\",BL20+BM20))","v":""},null,"Uit",null,null,"Uit","Uit dr.FP",null,95,"NG",null,null,null,null,null,null,null,null,null,null,null,null,null,null,null,null,null,null,null,null,null,null,null,null,{"$f":"IF(Y20=\"\",\"\",IF(ISTEXT(Y20),Y20,SUM(Y20:AW20)))","v":"NG"},null,null,95,null,"13:12:00",null,"","","",null,{"$f":"IF(K20=\"\",\"\",IF(ISTEXT(K20),K20,IF(K20>Basis!$N$9,\"Uit\",IF(ISBLANK(L20),K20,K20+L20))))","v":"NG"},"Uit","",{"$f":"IF(N20=\"\",\"\",IF(BK20<=Basis!$F$9,0,(BK20-Basis!$F$9)*0.4))","v":""},{"$f":"IF(N20=\"\",\"\",IF(BK20>Basis!$G$9,0,(Basis!$G$9-BK20)*0.4))","v":""},"NG"]
["HC",null,69,"154707BM","Madelene Mertens","Boxer","RV. Sportvrienden",187.5,187.5,{"$f":"IF(H21=\"\",\"\",IF(ISTEXT(H21),H21,IF(I21=\"\",\"\",IF((H21+I21)/2<=Basis!$M$9,\"Uit\",(100-((H21+I21)/2/Basis!$L$9*100))*Basis!$Y$6))))","v":37.5},0,0,40,5,27,{"$f":"IF(N21=\"\",\"\",IF(N21*60+O21>Basis!$U$9,\"Uit\",BL21+BM21))","v":28.8},null,106.3,null,null,106.3,{"$f":"IF(AY21=\"\",\"\",AY21)","v":""},null,69,0,"-","-","-","-","-","-","-",20,"-",20,"-","-","-","-","-","-","-","-","-","-","-",null,null,null,{"$f":"IF(Y21=\"\",\"\",IF(ISTEXT(Y21),Y21,SUM(Y21:AW21)))","v":40},null,null,69,null,"11:42:00","11:47:27","00:05:27",5,27,null,{"$f":"IF(K21=\"\",\"\",IF(ISTEXT(K21),K21,IF(K21>Basis!$N$9,\"Uit\",IF(ISBLANK(L21),K21,K21+L21))))","v":0},37.5,327,{"$f":"IF(N21=\"\",\"\",IF(BK21<=Basis!$F$9,0,(BK21-Basis!$F$9)*0.4))","v":28.8},{"$f":"IF(N21=\"\",\"\",IF(BK21>Basis!$G$9,0,(Basis!$G$9-BK21)*0.4))","v":0},68.8]
["HC",null,79,"835708IK","Renske Kroeze","i'm Gold","RV. Leijeruiters Helvoirt (pv)","NG","NG",{"$f":"IF(H22=\"\",\"\",IF(ISTEXT(H22),H22,IF(I22=\"\",\"\",IF((H22+I22)/2<=Basis!$M$9,\"Uit\",(100-((H22+I22)/2/Basis!$L$9*100))*Basis!$Y$6))))","v":"NG"},4,0,0,4,45,{"$f":"IF(N22=\"\",\"\",IF(N22*60+O22>Basis!$U$9,\"Uit\",BL22+BM22))","v":12},null,"NG",null,null,"NG",{"$f":"IF(AY22=\"\",\"\",AY22)","v":""},null,79,0,"-","-","-","-","-","-","-","-","-","-","-","-","-","-","-","-","-","-","-","-","-",null,null,null,{"$f":"IF(Y22=\"\",\"\",IF(ISTEXT(Y22),Y22,SUM(Y22:AW22)))","v":0},null,null,79,null,"12:40:00","12:44:45","00:04:45",4,45,null,{"$f":"IF(K22=\"\",\"\",IF(ISTEXT(K22),K22,IF(K22>Basis!$N$9,\"Uit\",IF(ISBLANK(L22),K22,K22+L22))))","v":4},"NG",285,{"$f":"IF(N22=\"\",\"\",IF(BK22<=Basis!$F$9,0,(BK22-Basis!$F$9)*0.4))","v":12},{"$f":"IF(N22=\"\",\"\",IF(BK22>Basis!$G$9,0,(Basis!$G$9-BK22)*0.4))","v":0},12]
[null,null,91,"815658ME","Tim Eshuis","Mister Paddington","RV. Door Wilskracht Sterk","NG","NG",{"$f":"IF(H23=\"\",\"\",IF(ISTEXT(H23),H23,IF(I23=\"\",\"\",IF((H23+I23)/2<=Basis!$M$9,\"Uit\",(100-((H23+I23)/2/Basis!$L$9*100))*Basis!$Y$6))))","v":"NG"},"NG",null,"NG","","",{"$f":"IF(N23=\"\",\"\",IF(N23*60+O23>Basis!$U$9,\"Uit\",BL23+BM23))","v":""},null,"NG",null,null,"NG",{"$f":"IF(AY23=\"\",\"\",AY23)","v":""},null,91,"NG",null,null,null,null,null,null,null,null,null,null,null,null,null,null,null,null,null,null,null,null,null,null,null,null,{"$f":"IF(Y23=\"\",\"\",IF(ISTEXT(Y23),Y23,SUM(Y23:AW23)))","v":"NG"},null,null,91,null,"13:04:00",null,"","","",null,{"$f":"IF(K23=\"\",\"\",IF(ISTEXT(K23),K23,IF(K23>Basis!$N$9,\"Uit\",IF(ISBLANK(L23),K23,K23+L23))))","v":"NG"},"NG","",{"$f":"IF(N23=\"\",\"\",IF(BK23<=Basis!$F$9,0,(BK23-Basis!$F$9)*0.4))","v":""},{"$f":"IF(N23=\"\",\"\",IF(BK23>Basis!$G$9,0,(Basis!$G$9-BK23)*0.4))","v":""},"NG"]
[null,null,96,"687307EL","Lielle van Laren","Ennue","RV. Alvernase R.j.v.","NG","NG",{"$f":"IF(H24=\"\",\"\",IF(ISTEXT(H24),H24,IF(I24=\"\",\"\",IF((H24+I24)/2<=Basis!$M$9,\"Uit\",(100-((H24+I24)/2/Basis!$L$9*100))*Basis!$Y$6))))","v":"NG"},"NG",null,"NG","","",{"$f":"IF(N24=\"\",\"\",IF(N24*60+O24>Basis!$U$9,\"Uit\",BL24+BM24))","v":""},null,"NG",null,null,"NG",{"$f":"IF(AY24=\"\",\"\",AY24)","v":""},null,96,"NG",null,null,null,null,null,null,null,null,null,null,null,null,null,null,null,null,null,null,null,null,null,null,null,null,{"$f":"IF(Y24=\"\",\"\",IF(ISTEXT(Y24),Y24,SUM(Y24:AW24)))","v":"NG"},null,null,96,null,"13:14:00",null,"","","",null,{"$f":"IF(K24=\"\",\"\",IF(ISTEXT(K24),K24,IF(K24>Basis!$N$9,\"Uit\",IF(ISBLANK(L24),K24,K24+L24))))","v":"NG"},"NG","",{"$f":"IF(N24=\"\",\"\",IF(BK24<=Basis!$F$9,0,(BK24-Basis!$F$9)*0.4))","v":""},{"$f":"IF(N24=\"\",\"\",IF(BK24>Basis!$G$9,0,(Basis!$G$9-BK24)*0.4))","v":""},"NG"]
[null,null,null,null,null,null,null,null,null,{"$f":"IF(H25=\"\",\"\",IF(ISTEXT(H25),H25,IF(I25=\"\",\"\",IF((H25+I25)/2<=Basis!$M$9,\"Uit\",(100-((H25+I25)/2/Basis!$L$9*100))*Basis!$Y$6))))","v":""},null,null,{"$f":"IF(AX25=\"\",\"\",AX25)","v":""},{"$f":"IF(ISBLANK(BD25),\"\",BF25)","v":""},{"$f":"IF(ISBLANK(BD25),\"\",BG25)","v":""},{"$f":"IF(N25=\"\",\"\",IF(N25*60+O25>Basis!$U$9,\"Uit\",BL25+BM25))","v":""},null,{"$f":"IF(ISTEXT(BJ25),BJ25,IF(OR(ISBLANK(M25),M25=\"\",ISBLANK(Y25)),BJ25,IF(ISTEXT(BN25),BN25,BJ25+BN25)))","v":""},null,null,{"$f":"IF(R25=\"\",\"\",IF(ISTEXT(R25),R25,R25-S25-T25))","v":""},{"$f":"IF(AY25=\"\",\"\",AY25)","v":""},null,{"$f":"IF($C25=\"\",\"\",$C25)","v":""},null,null,null,null,null,null,null,null,null,null,null,null,null,null,null,null,null,null,null,null,null,null,null,null,null,{"$f":"IF(Y25=\"\",\"\",IF(ISTEXT(Y25),Y25,SUM(Y25:AW25)))","v":""},null,null,{"$f":"IF($C25=\"\",\"\",$C25)","v":""},null,null,null,{"$f":"IF(ISBLANK(BD25),\"\",BD25-BC25)","v":""},{"$f":"IF(ISBLANK(BD25),\"\",MINUTE(BE25))","v":""},{"$f":"IF(ISBLANK(BD25),\"\",SECOND(BE25))","v":""},null,{"$f":"IF(K25=\"\",\"\",IF(ISTEXT(K25),K25,IF(K25>Basis!$N$9,\"Uit\",IF(ISBLANK(L25),K25,K25+L25))))","v":""},{"$f":"IF(OR(ISTEXT(J25),BI25=\"\"),J25,IF(ISTEXT(BI25),BI25,J25+BI25))","v":""},{"$f":"IF(N25=\"\",\"\",N25*60+O25)","v":""},{"$f":"IF(N25=\"\",\"\",IF(BK25<=Basis!$F$9,0,(BK25-Basis!$F$9)*0.4))","v":""},{"$f":"IF(N25=\"\",\"\",IF(BK25>Basis!$G$9,0,(Basis!$G$9-BK25)*0.4))","v":""},{"$f":"IF(M25=\"\",\"\",IF(ISTEXT(M25),M25,IF(ISTEXT(P25),P25,M25+P25)))","v":""}]
[null,null,null,null,null,null,null,null,null,{"$f":"IF(H26=\"\",\"\",IF(ISTEXT(H26),H26,IF(I26=\"\",\"\",IF((H26+I26)/2<=Basis!$M$9,\"Uit\",(100-((H26+I26)/2/Basis!$L$9*100))*Basis!$Y$6))))","v":""},null,null,"","","",{"$f":"IF(N26=\"\",\"\",IF(N26*60+O26>Basis!$U$9,\"Uit\",BL26+BM26))","v":""},null,"",null,null,"","",null,"",null,null,null,null,null,null,null,null,null,null,null,null,null,null,null,null,null,null,null,null,null,null,null,null,null,"",null,null,"",null,null,null,"","","",null,{"$f":"IF(K26=\"\",\"\",IF(ISTEXT(K26),K26,IF(K26>Basis!$N$9,\"Uit\",IF(ISBLANK(L26),K26,K26+L26))))","v":""},"","",{"$f":"IF(N26=\"\",\"\",IF(BK26<=Basis!$F$9,0,(BK26-Basis!$F$9)*0.4))","v":""},{"$f":"IF(N26=\"\",\"\",IF(BK26>Basis!$G$9,0,(Basis!$G$9-BK26)*0.4))","v":""},""]
[null,null,null,null,null,null,null,null,null,{"$f":"IF(H27=\"\",\"\",IF(ISTEXT(H27),H27,IF(I27=\"\",\"\",IF((H27+I27)/2<=Basis!$M$9,\"Uit\",(100-((H27+I27)/2/Basis!$L$9*100))*Basis!$Y$6))))","v":""},null,null,"","","",{"$f":"IF(N27=\"\",\"\",IF(N27*60+O27>Basis!$U$9,\"Uit\",BL27+BM27))","v":""},null,"",null,null,"","",null,"",null,null,null,null,null,null,null,null,null,null,null,null,null,null,null,null,null,null,null,null,null,null,null,null,null,"",null,null,"",null,null,null,"","","",null,{"$f":"IF(K27=\"\",\"\",IF(ISTEXT(K27),K27,IF(K27>Basis!$N$9,\"Uit\",IF(ISBLANK(L27),K27,K27+L27))))","v":""},"","",{"$f":"IF(N27=\"\",\"\",IF(BK27<=Basis!$F$9,0,(BK27-Basis!$F$9)*0.4))","v":""},{"$f":"IF(N27=\"\",\"\",IF(BK27>Basis!$G$9,0,(Basis!$G$9-BK27)*0.4))","v":""},""]
[null,null,null,null,null,null,null,null,null,{"$f":"IF(H28=\"\",\"\",IF(ISTEXT(H28),H28,IF(I28=\"\",\"\",IF((H28+I28)/2<=Basis!$M$9,\"Uit\",(100-((H28+I28)/2/Basis!$L$9*100))*Basis!$Y$6))))","v":""},null,null,"","","",{"$f":"IF(N28=\"\",\"\",IF(N28*60+O28>Basis!$U$9,\"Uit\",BL28+BM28))","v":""},null,"",null,null,"","",null,"",null,null,null,null,null,null,null,null,null,null,null,null,null,null,null,null,null,null,null,null,null,null,null,null,null,"",null,null,"",null,null,null,"","","",null,{"$f":"IF(K28=\"\",\"\",IF(ISTEXT(K28),K28,IF(K28>Basis!$N$9,\"Uit\",IF(ISBLANK(L28),K28,K28+L28))))","v":""},"","",{"$f":"IF(N28=\"\",\"\",IF(BK28<=Basis!$F$9,0,(BK28-Basis!$F$9)*0.4))","v":""},{"$f":"IF(N28=\"\",\"\",IF(BK28>Basis!$G$9,0,(Basis!$G$9-BK28)*0.4))","v":""},""]
[null,null,null,null,null,null,null,null,null,{"$f":"IF(H29=\"\",\"\",IF(ISTEXT(H29),H29,IF(I29=\"\",\"\",IF((H29+I29)/2<=Basis!$M$9,\"Uit\",(100-((H29+I29)/2/Basis!$L$9*100))*Basis!$Y$6))))","v":""},null,null,{"$f":"IF(AX29=\"\",\"\",AX29)","v":""},{"$f":"IF(ISBLANK(BD29),\"\",BF29)","v":""},{"$f":"IF(ISBLANK(BD29),\"\",BG29)","v":""},{"$f":"IF(N29=\"\",\"\",IF(N29*60+O29>Basis!$U$9,\"Uit\",BL29+BM29))","v":""},null,{"$f":"IF(ISTEXT(BJ29),BJ29,IF(OR(ISBLANK(M29),M29=\"\",ISBLANK(Y29)),BJ29,IF(ISTEXT(BN29),BN29,BJ29+BN29)))","v":""},null,null,{"$f":"IF(R29=\"\",\"\",IF(ISTEXT(R29),R29,R29-S29-T29))","v":""},{"$f":"IF(AY29=\"\",\"\",AY29)","v":""},null,"",null,null,null,null,null,null,null,null,null,null,null,null,null,null,null,null,null,null,null,null,null,null,null,null,null,{"$f":"IF(Y29=\"\",\"\",IF(ISTEXT(Y29),Y29,SUM(Y29:AW29)))","v":""},null,null,"",null,null,null,{"$f":"IF(ISBLANK(BD29),\"\",BD29-BC29)","v":""},{"$f":"IF(ISBLANK(BD29),\"\",MINUTE(BE29))","v":""},{"$f":"IF(ISBLANK(BD29),\"\",SECOND(BE29))","v":""},null,{"$f":"IF(K29=\"\",\"\",IF(ISTEXT(K29),K29,IF(K29>Basis!$N$9,\"Uit\",IF(ISBLANK(L29),K29,K29+L29))))","v":""},"","",{"$f":"IF(N29=\"\",\"\",IF(BK29<=Basis!$F$9,0,(BK29-Basis!$F$9)*0.4))","v":""},{"$f":"IF(N29=\"\",\"\",IF(BK29>Basis!$G$9,0,(Basis!$G$9-BK29)*0.4))","v":""},""]
[null,null,null,null,null,null,null,null,null,{"$f":"IF(H30=\"\",\"\",IF(ISTEXT(H30),H30,IF(I30=\"\",\"\",IF((H30+I30)/2<=Basis!$M$9,\"Uit\",(100-((H30+I30)/2/Basis!$L$9*100))*Basis!$Y$6))))","v":""},null,null,{"$f":"IF(AX30=\"\",\"\",AX30)","v":""},{"$f":"IF(ISBLANK(BD30),\"\",BF30)","v":""},{"$f":"IF(ISBLANK(BD30),\"\",BG30)","v":""},{"$f":"IF(N30=\"\",\"\",IF(N30*60+O30>Basis!$U$9,\"Uit\",BL30+BM30))","v":""},null,{"$f":"IF(ISTEXT(BJ30),BJ30,IF(OR(ISBLANK(M30),M30=\"\",ISBLANK(Y30)),BJ30,IF(ISTEXT(BN30),BN30,BJ30+BN30)))","v":""},null,null,{"$f":"IF(R30=\"\",\"\",IF(ISTEXT(R30),R30,R30-S30-T30))","v":""},{"$f":"IF(AY30=\"\",\"\",AY30)","v":""},null,"",null,null,null,null,null,null,null,null,null,null,null,null,null,null,null,null,null,null,null,null,null,null,null,null,null,{"$f":"IF(Y30=\"\",\"\",IF(ISTEXT(Y30),Y30,SUM(Y30:AW30)))","v":""},null,null,"",null,null,null,{"$f":"IF(ISBLANK(BD30),\"\",BD30-BC30)","v":""},{"$f":"IF(ISBLANK(BD30),\"\",MINUTE(BE30))","v":""},{"$f":"IF(ISBLANK(BD30),\"\",SECOND(BE30))","v":""},null,{"$f":"IF(K30=\"\",\"\",IF(ISTEXT(K30),K30,IF(K30>Basis!$N$9,\"Uit\",IF(ISBLANK(L30),K30,K30+L30))))","v":""},{"$f":"IF(OR(ISTEXT(J30),BI30=\"\"),J30,IF(ISTEXT(BI30),BI30,J30+BI30))","v":""},{"$f":"IF(N30=\"\",\"\",N30*60+O30)","v":""},{"$f":"IF(N30=\"\",\"\",IF(BK30<=Basis!$F$9,0,(BK30-Basis!$F$9)*0.4))","v":""},{"$f":"IF(N30=\"\",\"\",IF(BK30>Basis!$G$9,0,(Basis!$G$9-BK30)*0.4))","v":""},{"$f":"IF(M30=\"\",\"\",IF(ISTEXT(M30),M30,IF(ISTEXT(P30),P30,M30+P30)))","v":""}]
["  Bij uitsluiting reden vermelden : ",null,null,null,null,null,null,null,null,null,null,null,null,null,null,{"$f":"NOW()","v":"2018-06-30T22:02:24.880"},null,null,null,null,null,null,null,{"$f":"A31","v":"  Bij uitsluiting reden vermelden : "},null,null,null,null,null,null,null,null,null,null,null,null,null,null,null,null,null,null,null,null,null,null,{"$f":"NOW()","v":"2018-06-30T22:02:24.880"}]
["  VP=val paard, VR=val ruiter, 3W=3 weigeringen op zelfde hindernis, 4W=4 weigeringen totaal, FP=foutief parcours, Vr.v= vrijwillig verlaten",null,null,null,null,null,null,null,null,null,null,null,null,null,null,null,null,null,null,null,null,null,null,{"$f":"A32","v":"  VP=val paard, VR=val ruiter, 3W=3 weigeringen op zelfde hindernis, 4W=4 weigeringen totaal, FP=foutief parcours, Vr.v= vrijwillig verlaten"}]

{"sheet":"Ring 4 - Lpaarden","index":8,"n_rows":30,"n_cols":66,"rows_kept":30,"cut":false,"hidden":false,"merged":[[1,7,1,8],[2,13,2,14],[28,15,28,21],[28,46,28,52]]}
[{"$f":"\" Samengestelde wedstrijd \"&Basis!D5","v":" Samengestelde wedstrijd Eventing Leende 30 juni 2018"},null,null,null,null,null,"Klasse L paarden - Ring 4",null,null,null,"Dressuurjury : ","Anita Feije",null,null,null,null,null,null,null,null,null,null,null," Verzamelstaat hindernisfouten in de cross",null,null,null,null,null,null,null,null,null,null,null,null,{"$f":"A1","v":" Samengestelde wedstrijd Eventing Leende 30 juni 2018"},null,null,null,null,null,null,null,null,null,null,null,null,null,null,null,{"$f":"G1&\" \"","v":"Klasse L paarden - Ring 4 "},null," Indien aankomstUUR cross wordt meegedeeld :",null,null,null,null,null," Hulpkolommen"]
["rank",null,"rugnr","combinatie nr","naam ruiter","naam paard","vereniging / plaats","dressuur",null,"dressuur","hind.ft.","tijd.ft.","hind.ft.","min","sec","tijd.ft.",null,"totaal","(1) stijl","(2) stijl","eind-","reden",null,null,"hindernisnummer",null,null,null,null,null,null,null,null,null,null,null,null,null,null,null,null,null,null,null,null,null,null,null,null,null," ",null,null,null,null,null,null,null,null,null,"Uitslag","NA","tijd (sec)","tijd.ft.","reg.ft.","totaal"]
["HC",null,null,null,null,null,null,"Jury C","Jury 2","strafpntn.","springen","springen","cross","cross",null,{"$f":"Basis!$H$9&\":\"&TEXT(Basis!$I$9,\"00\")","v":"4:15"},null,null,"cijfer","cijfer","totaal","uitsluiting",null,"nr",1,2,3,"4ab",5,6,7,8,9,10,11,12,13,14,15,"VD","16ab","VD",17,18,19,"F",null,null,null,"totaal","reden uitsluiting","hind.","nr",null,"Vertrekuur","Aankomst","Tijd","Minuten","Seconden",null,"Springen","Springen","cross","opt.tijd =",{"$f":"Basis!$H$9&\":\"&TEXT(Basis!$I$9,\"00\")","v":"4:15"},"cross"]
[null,null,null,null,null,null,null,null,null,null,null,null,null,null,null,null,null,{"$f":"IF(ISBLANK(I4),\"\",IF(AND(ISBLANK(K4),ISBLANK(Y4)),J4,IF(ISTEXT(K4),K4,IF(OR(ISBLANK(M4),M4=\"\"),J4+K4+L4,IF(ISTEXT(M4),M4,IF(ISBLANK(Y4),J4+K4+L4,J4+K4+L4+M4+P4+Q4))))))","v":""}]
[1,null,81,"573574FD","Maxime Devos","Fresh Orange Zaline","RV. Peelrossen",218,218,{"$f":"IF(H5=\"\",\"\",IF(ISTEXT(H5),H5,IF(I5=\"\",\"\",IF((H5+I5)/2<=Basis!$M$9,\"Uit\",(100-((H5+I5)/2/Basis!$L$9*100))*Basis!$Y$6))))","v":27.333333333333329},0,0,{"$f":"IF(AX5=\"\",\"\",AX5)","v":0},{"$f":"IF(ISBLANK(BD5),\"\",BF5)","v":4},{"$f":"IF(ISBLANK(BD5),\"\",BG5)","v":16},{"$f":"IF(N5=\"\",\"\",IF(N5*60+O5>Basis!$U$9,\"Uit\",BL5+BM5))","v":0.4},null,{"$f":"IF(ISTEXT(BJ5),BJ5,IF(OR(ISBLANK(M5),M5=\"\",ISBLANK(Y5)),BJ5,IF(ISTEXT(BN5),BN5,BJ5+BN5)))","v":27.733333333333327},null,null,{"$f":"IF(R5=\"\",\"\",IF(ISTEXT(R5),R5,R5-S5-T5))","v":27.733333333333327},{"$f":"IF(AY5=\"\",\"\",AY5)","v":""},null,{"$f":"IF($C5=\"\",\"\",$C5)","v":81},0,"-","-","-","-","-","-","-","-","-","-","-","-","-","-","-","-","-","-","-","-","-",null,null,null,{"$f":"IF(Y5=\"\",\"\",IF(ISTEXT(Y5),Y5,SUM(Y5:AW5)))","v":0},null,null,{"$f":"IF($C5=\"\",\"\",$C5)","v":81},null,"12:44:00","12:48:16",{"$f":"IF(ISBLANK(BD5),\"\",BD5-BC5)","v":"00:04:16"},{"$f":"IF(ISBLANK(BD5),\"\",MINUTE(BE5))","v":4},{"$f":"IF(ISBLANK(BD5),\"\",SECOND(BE5))","v":16},null,{"$f":"IF(K5=\"\",\"\",IF(ISTEXT(K5),K5,IF(K5>Basis!$N$9,\"Uit\",IF(ISBLANK(L5),K5,K5+L5))))","v":0},{"$f":"IF(OR(ISTEXT(J5),BI5=\"\"),J5,IF(ISTEXT(BI5),BI5,J5+BI5))","v":27.333333333333329},{"$f":"IF(N5=\"\",\"\",N5*60+O5)","v":256},{"$f":"IF(N5=\"\",\"\",IF(BK5<=Basis!$F$9,0,(BK5-Basis!$F$9)*0.4))","v":0.4},{"$f":"IF(N5=\"\",\"\",IF(BK5>Basis!$G$9,0,(Basis!$G$9-BK5)*0.4))","v":0},{"$f":"IF(M5=\"\",\"\",IF(ISTEXT(M5),M5,IF(ISTEXT(P5),P5,M5+P5)))","v":0.4}]
[2,null,99,"719468JV","Ilse Vossen","Jacobo","RV. Equinus Stramproy",223,223,{"$f":"IF(H6=\"\",\"\",IF(ISTEXT(H6),H6,IF(I6=\"\",\"\",IF((H6+I6)/2<=Basis!$M$9,\"Uit\",(100-((H6+I6)/2/Basis!$L$9*100))*Basis!$Y$6))))","v":25.666666666666671},4,0,0,4,16,{"$f":"IF(N6=\"\",\"\",IF(N6*60+O6>Basis!$U$9,\"Uit\",BL6+BM6))","v":0.4},null,30.06666666666667,null,null,30.06666666666667,"",null,99,0,"-","-","-","-","-","-","-","-","-","-","-","-","-","-","-","-","-","-","-","-","-",null,null,null,0,null,null,99,null,"13:20:00","13:24:16","00:04:16",4,16,null,{"$f":"IF(K6=\"\",\"\",IF(ISTEXT(K6),K6,IF(K6>Basis!$N$9,\"Uit\",IF(ISBLANK(L6),K6,K6+L6))))","v":4},29.666666666666671,256,{"$f":"IF(N6=\"\",\"\",IF(BK6<=Basis!$F$9,0,(BK6-Basis!$F$9)*0.4))","v":0.4},{"$f":"IF(N6=\"\",\"\",IF(BK6>Basis!$G$9,0,(Basis!$G$9-BK6)*0.4))","v":0},0.4]
[3,null,64,"847201ES","Adriaan Smeulders","Ekow","RV. Zelden Rust",204,204,{"$f":"IF(H7=\"\",\"\",IF(ISTEXT(H7),H7,IF(I7=\"\",\"\",IF((H7+I7)/2<=Basis!$M$9,\"Uit\",(100-((H7+I7)/2/Basis!$L$9*100))*Basis!$Y$6))))","v":32},0,0,0,4,27,{"$f":"IF(N7=\"\",\"\",IF(N7*60+O7>Basis!$U$9,\"Uit\",BL7+BM7))","v":4.8000000000000007},null,36.799999999999997,null,null,36.799999999999997,"",null,64,0,"-","-","-","-","-","-","-","-","-","-","-","-","-","-","-","-","-","-","-","-","-",null,null,null,0,null,null,64,null,"11:32:00","11:36:27","00:04:27",4,27,null,{"$f":"IF(K7=\"\",\"\",IF(ISTEXT(K7),K7,IF(K7>Basis!$N$9,\"Uit\",IF(ISBLANK(L7),K7,K7+L7))))","v":0},32,267,{"$f":"IF(N7=\"\",\"\",IF(BK7<=Basis!$F$9,0,(BK7-Basis!$F$9)*0.4))","v":4.8000000000000007},{"$f":"IF(N7=\"\",\"\",IF(BK7>Basis!$G$9,0,(Basis!$G$9-BK7)*0.4))","v":0},4.8000000000000007]
[4,null,72,"629375MP","Anneke Pardoel","Mister Cadillac Z","RV. Heideruiters",206,206,{"$f":"IF(H8=\"\",\"\",IF(ISTEXT(H8),H8,IF(I8=\"\",\"\",IF((H8+I8)/2<=Basis!$M$9,\"Uit\",(100-((H8+I8)/2/Basis!$L$9*100))*Basis!$Y$6))))","v":31.333333333333329},0,0,0,4,29,{"$f":"IF(N8=\"\",\"\",IF(N8*60+O8>Basis!$U$9,\"Uit\",BL8+BM8))","v":5.6000000000000005},null,36.93333333333333,null,null,36.93333333333333,"",null,72,0,"-","-","-","-","-","-","-","-","-","-","-","-","-","-","-","-","-","-","-","-","-",null,null,null,0,null,null,72,null,"11:48:00","11:52:29","00:04:29",4,29,null,{"$f":"IF(K8=\"\",\"\",IF(ISTEXT(K8),K8,IF(K8>Basis!$N$9,\"Uit\",IF(ISBLANK(L8),K8,K8+L8))))","v":0},31.333333333333329,269,{"$f":"IF(N8=\"\",\"\",IF(BK8<=Basis!$F$9,0,(BK8-Basis!$F$9)*0.4))","v":5.6000000000000005},{"$f":"IF(N8=\"\",\"\",IF(BK8>Basis!$G$9,0,(Basis!$G$9-BK8)*0.4))","v":0},5.6000000000000005]
[5,null,100,"852618NK","Renske Kroeze","Nearly Perfect","RV. Leijeruiters Helvoirt (pv)",204,204,{"$f":"IF(H9=\"\",\"\",IF(ISTEXT(H9),H9,IF(I9=\"\",\"\",IF((H9+I9)/2<=Basis!$M$9,\"Uit\",(100-((H9+I9)/2/Basis!$L$9*100))*Basis!$Y$6))))","v":32},0,0,0,4,31,{"$f":"IF(N9=\"\",\"\",IF(N9*60+O9>Basis!$U$9,\"Uit\",BL9+BM9))","v":6.4},null,38.4,null,null,38.4,"",null,100,0,"-","-","-","-","-","-","-","-","-","-","-","-","-","-","-","-","-","-","-","-","-",null,null,null,0,null,null,100,null,"13:22:00","13:26:31","00:04:31",4,31,null,{"$f":"IF(K9=\"\",\"\",IF(ISTEXT(K9),K9,IF(K9>Basis!$N$9,\"Uit\",IF(ISBLANK(L9),K9,K9+L9))))","v":0},32,271,{"$f":"IF(N9=\"\",\"\",IF(BK9<=Basis!$F$9,0,(BK9-Basis!$F$9)*0.4))","v":6.4},{"$f":"IF(N9=\"\",\"\",IF(BK9>Basis!$G$9,0,(Basis!$G$9-BK9)*0.4))","v":0},6.4]
[6,null,87,"784138FB","Geesje Burema","Favourite Times","RV. Heeze (rsv.)",175.5,175.5,{"$f":"IF(H10=\"\",\"\",IF(ISTEXT(H10),H10,IF(I10=\"\",\"\",IF((H10+I10)/2<=Basis!$M$9,\"Uit\",(100-((H10+I10)/2/Basis!$L$9*100))*Basis!$Y$6))))","v":41.5},0,0,0,4,10,{"$f":"IF(N10=\"\",\"\",IF(N10*60+O10>Basis!$U$9,\"Uit\",BL10+BM10))","v":0},null,41.5,null,null,41.5,"",null,87,0,"-","-","-","-","-","-","-","-","-","-","-","-","-","-","-","-","-","-","-","-","-",null,null,null,0,null,null,87,null,"12:56:00","13:00:10","00:04:10",4,10,null,{"$f":"IF(K10=\"\",\"\",IF(ISTEXT(K10),K10,IF(K10>Basis!$N$9,\"Uit\",IF(ISBLANK(L10),K10,K10+L10))))","v":0},41.5,250,{"$f":"IF(N10=\"\",\"\",IF(BK10<=Basis!$F$9,0,(BK10-Basis!$F$9)*0.4))","v":0},{"$f":"IF(N10=\"\",\"\",IF(BK10>Basis!$G$9,0,(Basis!$G$9-BK10)*0.4))","v":0},0]
[7,null,97,"853427HK","Ilonka Kluytmans","Hirkam",null,189,189,{"$f":"IF(H11=\"\",\"\",IF(ISTEXT(H11),H11,IF(I11=\"\",\"\",IF((H11+I11)/2<=Basis!$M$9,\"Uit\",(100-((H11+I11)/2/Basis!$L$9*100))*Basis!$Y$6))))","v":37},8,0,0,4,24,{"$f":"IF(N11=\"\",\"\",IF(N11*60+O11>Basis!$U$9,\"Uit\",BL11+BM11))","v":3.6},null,48.6,null,null,48.6,"",null,97,0,"-","-","-","-","-","-","-","-","-","-","-","-","-","-","-","-","-","-","-","-","-",null,null,null,0,null,null,97,null,"13:16:00","13:20:24","00:04:24",4,24,null,{"$f":"IF(K11=\"\",\"\",IF(ISTEXT(K11),K11,IF(K11>Basis!$N$9,\"Uit\",IF(ISBLANK(L11),K11,K11+L11))))","v":8},45,264,{"$f":"IF(N11=\"\",\"\",IF(BK11<=Basis!$F$9,0,(BK11-Basis!$F$9)*0.4))","v":3.6},{"$f":"IF(N11=\"\",\"\",IF(BK11>Basis!$G$9,0,(Basis!$G$9-BK11)*0.4))","v":0},3.6]
[8,null,83,"706460EJ","Babette Jochems","Eridain","RV. Door Eenheid Sterk",204,204,{"$f":"IF(H12=\"\",\"\",IF(ISTEXT(H12),H12,IF(I12=\"\",\"\",IF((H12+I12)/2<=Basis!$M$9,\"Uit\",(100-((H12+I12)/2/Basis!$L$9*100))*Basis!$Y$6))))","v":32},0,0,20,5,0,{"$f":"IF(N12=\"\",\"\",IF(N12*60+O12>Basis!$U$9,\"Uit\",BL12+BM12))","v":18},null,70,null,null,70,"",null,83,0,"-","-","-","-","-","-","-",20,"-","-","-","-","-","-","-","-","-","-","-","-","-",null,null,null,20,null,null,83,null,"12:48:00","12:53:00","00:05:00",5,0,null,{"$f":"IF(K12=\"\",\"\",IF(ISTEXT(K12),K12,IF(K12>Basis!$N$9,\"Uit\",IF(ISBLANK(L12),K12,K12+L12))))","v":0},32,300,{"$f":"IF(N12=\"\",\"\",IF(BK12<=Basis!$F$9,0,(BK12-Basis!$F$9)*0.4))","v":18},{"$f":"IF(N12=\"\",\"\",IF(BK12>Basis!$G$9,0,(Basis!$G$9-BK12)*0.4))","v":0},38]
[9,null,90,"842830EC","Jeannette Chardon","Esprit",null,214.5,214.5,{"$f":"IF(H13=\"\",\"\",IF(ISTEXT(H13),H13,IF(I13=\"\",\"\",IF((H13+I13)/2<=Basis!$M$9,\"Uit\",(100-((H13+I13)/2/Basis!$L$9*100))*Basis!$Y$6))))","v":28.5},0,0,20,6,13,{"$f":"IF(N13=\"\",\"\",IF(N13*60+O13>Basis!$U$9,\"Uit\",BL13+BM13))","v":47.2},null,95.7,null,null,95.7,"",null,90,0,"-","-","-",20,"-","-","-","-","-","-","-","-","-","-","-","-","-","-","-","-","-",null,null,null,20,null,null,90,null,"13:02:00","13:08:13","00:06:13",6,13,null,{"$f":"IF(K13=\"\",\"\",IF(ISTEXT(K13),K13,IF(K13>Basis!$N$9,\"Uit\",IF(ISBLANK(L13),K13,K13+L13))))","v":0},28.5,373,{"$f":"IF(N13=\"\",\"\",IF(BK13<=Basis!$F$9,0,(BK13-Basis!$F$9)*0.4))","v":47.2},{"$f":"IF(N13=\"\",\"\",IF(BK13>Basis!$G$9,0,(Basis!$G$9-BK13)*0.4))","v":0},67.2]
[10,null,85,"750824ZO","Dirk Ockhuizen","Zevenster PCN","RV. Militaire Ruitersportvereniging 'Te Paard!' *",187.2,187.2,{"$f":"IF(H14=\"\",\"\",IF(ISTEXT(H14),H14,IF(I14=\"\",\"\",IF((H14+I14)/2<=Basis!$M$9,\"Uit\",(100-((H14+I14)/2/Basis!$L$9*100))*Basis!$Y$6))))","v":37.6},4,0,60,5,38,{"$f":"IF(N14=\"\",\"\",IF(N14*60+O14>Basis!$U$9,\"Uit\",BL14+BM14))","v":33.200000000000003},null,134.80000000000001,null,null,134.80000000000001,"",null,85,0,"-","-","-",20,"-","-","-","-","-","-","-","-","-","-","-",20,"-",20,"-","-","-",null,null,null,60,null,null,85,null,"12:52:00","12:57:38","00:05:38",5,38,null,{"$f":"IF(K14=\"\",\"\",IF(ISTEXT(K14),K14,IF(K14>Basis!$N$9,\"Uit\",IF(ISBLANK(L14),K14,K14+L14))))","v":4},41.6,338,{"$f":"IF(N14=\"\",\"\",IF(BK14<=Basis!$F$9,0,(BK14-Basis!$F$9)*0.4))","v":33.200000000000003},{"$f":"IF(N14=\"\",\"\",IF(BK14>Basis!$G$9,0,(Basis!$G$9-BK14)*0.4))","v":0},93.2]
[11,null,78,"853079AB","Frederique Brouwers","Annaghmore Qualistar","RV. Fevior (r.s.v.)",163.5,163.5,{"$f":"IF(H15=\"\",\"\",IF(ISTEXT(H15),H15,IF(I15=\"\",\"\",IF((H15+I15)/2<=Basis!$M$9,\"Uit\",(100-((H15+I15)/2/Basis!$L$9*100))*Basis!$Y$6))))","v":45.499999999999993},0,0,80,6,24,{"$f":"IF(N15=\"\",\"\",IF(N15*60+O15>Basis!$U$9,\"Uit\",BL15+BM15))","v":51.6},null,177.1,null,null,177.1,"",null,78,0,"-","-",60,20,"-","-","-","-","-","-","-","-","-","-","-","-","-","-","-","-","-",null,null,null,80,null,null,78,null,"12:38:00","12:44:24","00:06:24",6,24,null,{"$f":"IF(K15=\"\",\"\",IF(ISTEXT(K15),K15,IF(K15>Basis!$N$9,\"Uit\",IF(ISBLANK(L15),K15,K15+L15))))","v":0},45.499999999999993,384,{"$f":"IF(N15=\"\",\"\",IF(BK15<=Basis!$F$9,0,(BK15-Basis!$F$9)*0.4))","v":51.6},{"$f":"IF(N15=\"\",\"\",IF(BK15>Basis!$G$9,0,(Basis!$G$9-BK15)*0.4))","v":0},131.6]
[12,null,66,"547197CS","Peter van Stiphout","Chihua Z","RV. Ysselsteyn",189.5,189.5,{"$f":"IF(H16=\"\",\"\",IF(ISTEXT(H16),H16,IF(I16=\"\",\"\",IF((H16+I16)/2<=Basis!$M$9,\"Uit\",(100-((H16+I16)/2/Basis!$L$9*100))*Basis!$Y$6))))","v":36.833333333333329},4,0,"Uit",4,21,{"$f":"IF(N16=\"\",\"\",IF(N16*60+O16>Basis!$U$9,\"Uit\",BL16+BM16))","v":2.4000000000000004},null,"Uit",null,null,"Uit","FP VD 16/17",null,66,0,"-","-","-","-","-","-","-","-","-","-","-","-","-","-","-","-","FP","-","-","-","-",null,null,null,"Uit","FP VD 16/17",null,66,null,"11:36:00","11:40:21","00:04:21",4,21,null,{"$f":"IF(K16=\"\",\"\",IF(ISTEXT(K16),K16,IF(K16>Basis!$N$9,\"Uit\",IF(ISBLANK(L16),K16,K16+L16))))","v":4},40.833333333333329,261,{"$f":"IF(N16=\"\",\"\",IF(BK16<=Basis!$F$9,0,(BK16-Basis!$F$9)*0.4))","v":2.4000000000000004},{"$f":"IF(N16=\"\",\"\",IF(BK16>Basis!$G$9,0,(Basis!$G$9-BK16)*0.4))","v":0},"Uit"]
[13,null,68,"801139HS","Martijn van Stiphout","Hannibal","RV. Nijnselse Ruiters",220,220,{"$f":"IF(H17=\"\",\"\",IF(ISTEXT(H17),H17,IF(I17=\"\",\"\",IF((H17+I17)/2<=Basis!$M$9,\"Uit\",(100-((H17+I17)/2/Basis!$L$9*100))*Basis!$Y$6))))","v":26.666666666666671},0,0,"Uit",4,32,{"$f":"IF(N17=\"\",\"\",IF(N17*60+O17>Basis!$U$9,\"Uit\",BL17+BM17))","v":6.8000000000000007},null,"Uit",null,null,"Uit","FP VD 16/17",null,68,0,"-","-","-","-","-","-","-","-","-","-","-","-","-","-","-","-","FP","-","-","-","-",null,null,null,"Uit","FP VD 16/17",null,68,null,"11:40:00","11:44:32","00:04:32",4,32,null,{"$f":"IF(K17=\"\",\"\",IF(ISTEXT(K17),K17,IF(K17>Basis!$N$9,\"Uit\",IF(ISBLANK(L17),K17,K17+L17))))","v":0},26.666666666666671,272,{"$f":"IF(N17=\"\",\"\",IF(BK17<=Basis!$F$9,0,(BK17-Basis!$F$9)*0.4))","v":6.8000000000000007},{"$f":"IF(N17=\"\",\"\",IF(BK17>Basis!$G$9,0,(Basis!$G$9-BK17)*0.4))","v":0},"Uit"]
[null,null,70,"771357BL","Harry van Loon","Bill Bailey","RV. Mierden","NG",null,{"$f":"IF(H18=\"\",\"\",IF(ISTEXT(H18),H18,IF(I18=\"\",\"\",IF((H18+I18)/2<=Basis!$M$9,\"Uit\",(100-((H18+I18)/2/Basis!$L$9*100))*Basis!$Y$6))))","v":"NG"},"NG",null,"NG","","",{"$f":"IF(N18=\"\",\"\",IF(N18*60+O18>Basis!$U$9,\"Uit\",BL18+BM18))","v":""},null,"NG",null,null,"NG","",null,70,"NG",null,null,null,null,null,null,null,null,null,null,null,null,null,null,null,null,null,null,null,null,null,null,null,null,{"$f":"IF(Y18=\"\",\"\",IF(ISTEXT(Y18),Y18,SUM(Y18:AW18)))","v":"NG"},null,null,70,null,"11:44:00",null,"","","",null,{"$f":"IF(K18=\"\",\"\",IF(ISTEXT(K18),K18,IF(K18>Basis!$N$9,\"Uit\",IF(ISBLANK(L18),K18,K18+L18))))","v":"NG"},"NG","",{"$f":"IF(N18=\"\",\"\",IF(BK18<=Basis!$F$9,0,(BK18-Basis!$F$9)*0.4))","v":""},{"$f":"IF(N18=\"\",\"\",IF(BK18>Basis!$G$9,0,(Basis!$G$9-BK18)*0.4))","v":""},"NG"]
[null,null,74,"788311UO","Fran Oostenmeijer","Un de Neipo","RV. Gastlicentie","NG",null,{"$f":"IF(H19=\"\",\"\",IF(ISTEXT(H19),H19,IF(I19=\"\",\"\",IF((H19+I19)/2<=Basis!$M$9,\"Uit\",(100-((H19+I19)/2/Basis!$L$9*100))*Basis!$Y$6))))","v":"NG"},"NG",null,"NG","","",{"$f":"IF(N19=\"\",\"\",IF(N19*60+O19>Basis!$U$9,\"Uit\",BL19+BM19))","v":""},null,"NG",null,null,"NG","",null,74,"NG",null,null,null,null,null,null,null,null,null,null,null,null,null,null,null,null,null,null,null,null,null,null,null,null,{"$f":"IF(Y19=\"\",\"\",IF(ISTEXT(Y19),Y19,SUM(Y19:AW19)))","v":"NG"},null,null,74,null,"12:30:00",null,"","","",null,{"$f":"IF(K19=\"\",\"\",IF(ISTEXT(K19),K19,IF(K19>Basis!$N$9,\"Uit\",IF(ISBLANK(L19),K19,K19+L19))))","v":"NG"},"NG","",{"$f":"IF(N19=\"\",\"\",IF(BK19<=Basis!$F$9,0,(BK19-Basis!$F$9)*0.4))","v":""},{"$f":"IF(N19=\"\",\"\",IF(BK19>Basis!$G$9,0,(Basis!$G$9-BK19)*0.4))","v":""},"NG"]
[null,null,76,"856220GB","Willem Broekman","Gidion","RV. de Voornruiters","NG",null,{"$f":"IF(H20=\"\",\"\",IF(ISTEXT(H20),H20,IF(I20=\"\",\"\",IF((H20+I20)/2<=Basis!$M$9,\"Uit\",(100-((H20+I20)/2/Basis!$L$9*100))*Basis!$Y$6))))","v":"NG"},"NG",null,"NG","","",{"$f":"IF(N20=\"\",\"\",IF(N20*60+O20>Basis!$U$9,\"Uit\",BL20+BM20))","v":""},null,"NG",null,null,"NG","",null,76,"NG",null,null,null,null,null,null,null,null,null,null,null,null,null,null,null,null,null,null,null,null,null,null,null,null,{"$f":"IF(Y20=\"\",\"\",IF(ISTEXT(Y20),Y20,SUM(Y20:AW20)))","v":"NG"},null,null,76,null,"12:34:00",null,"","","",null,{"$f":"IF(K20=\"\",\"\",IF(ISTEXT(K20),K20,IF(K20>Basis!$N$9,\"Uit\",IF(ISBLANK(L20),K20,K20+L20))))","v":"NG"},"NG","",{"$f":"IF(N20=\"\",\"\",IF(BK20<=Basis!$F$9,0,(BK20-Basis!$F$9)*0.4))","v":""},{"$f":"IF(N20=\"\",\"\",IF(BK20>Basis!$G$9,0,(Basis!$G$9-BK20)*0.4))","v":""},"NG"]
[null,null,88,"802945MB","Lilian Bakker","Taloubet 2 K Z","Manege De Hoef V.O.F.",171,171,{"$f":"IF(H21=\"\",\"\",IF(ISTEXT(H21),H21,IF(I21=\"\",\"\",IF((H21+I21)/2<=Basis!$M$9,\"Uit\",(100-((H21+I21)/2/Basis!$L$9*100))*Basis!$Y$6))))","v":43.000000000000007},"NG",null,"NG","","",{"$f":"IF(N21=\"\",\"\",IF(N21*60+O21>Basis!$U$9,\"Uit\",BL21+BM21))","v":""},null,"NG",null,null,"NG","",null,88,"NG",null,null,null,null,null,null,null,null,null,null,null,null,null,null,null,null,null,null,null,null,null,null,null,null,{"$f":"IF(Y21=\"\",\"\",IF(ISTEXT(Y21),Y21,SUM(Y21:AW21)))","v":"NG"},null,null,88,null,"13:00:00",null,"","","",null,{"$f":"IF(K21=\"\",\"\",IF(ISTEXT(K21),K21,IF(K21>Basis!$N$9,\"Uit\",IF(ISBLANK(L21),K21,K21+L21))))","v":"NG"},"NG","",{"$f":"IF(N21=\"\",\"\",IF(BK21<=Basis!$F$9,0,(BK21-Basis!$F$9)*0.4))","v":""},{"$f":"IF(N21=\"\",\"\",IF(BK21>Basis!$G$9,0,(Basis!$G$9-BK21)*0.4))","v":""},"NG"]
[null,null,98,"824358HC","Minouche Castricum","High Five","Manege De Hoef V.O.F.",181,181,{"$f":"IF(H22=\"\",\"\",IF(ISTEXT(H22),H22,IF(I22=\"\",\"\",IF((H22+I22)/2<=Basis!$M$9,\"Uit\",(100-((H22+I22)/2/Basis!$L$9*100))*Basis!$Y$6))))","v":39.666666666666664},"NG",null,"NG","","",{"$f":"IF(N22=\"\",\"\",IF(N22*60+O22>Basis!$U$9,\"Uit\",BL22+BM22))","v":""},null,"NG",null,null,"NG","",null,98,"NG",null,null,null,null,null,null,null,null,null,null,null,null,null,null,null,null,null,null,null,null,null,null,null,null,{"$f":"IF(Y22=\"\",\"\",IF(ISTEXT(Y22),Y22,SUM(Y22:AW22)))","v":"NG"},null,null,98,null,"13:18:00",null,"","","",null,{"$f":"IF(K22=\"\",\"\",IF(ISTEXT(K22),K22,IF(K22>Basis!$N$9,\"Uit\",IF(ISBLANK(L22),K22,K22+L22))))","v":"NG"},"NG","",{"$f":"IF(N22=\"\",\"\",IF(BK22<=Basis!$F$9,0,(BK22-Basis!$F$9)*0.4))","v":""},{"$f":"IF(N22=\"\",\"\",IF(BK22>Basis!$G$9,0,(Basis!$G$9-BK22)*0.4))","v":""},"NG"]
[null,null,null,null,null,null,null,null,null,{"$f":"IF(H23=\"\",\"\",IF(ISTEXT(H23),H23,IF(I23=\"\",\"\",IF((H23+I23)/2<=Basis!$M$9,\"Uit\",(100-((H23+I23)/2/Basis!$L$9*100))*Basis!$Y$6))))","v":""},null,null,{"$f":"IF(AX23=\"\",\"\",AX23)","v":""},{"$f":"IF(ISBLANK(BD23),\"\",BF23)","v":""},{"$f":"IF(ISBLANK(BD23),\"\",BG23)","v":""},{"$f":"IF(N23=\"\",\"\",IF(N23*60+O23>Basis!$U$9,\"Uit\",BL23+BM23))","v":""},null,{"$f":"IF(ISTEXT(BJ23),BJ23,IF(OR(ISBLANK(M23),M23=\"\",ISBLANK(Y23)),BJ23,IF(ISTEXT(BN23),BN23,BJ23+BN23)))","v":""},null,null,{"$f":"IF(R23=\"\",\"\",IF(ISTEXT(R23),R23,R23-S23-T23))","v":""},{"$f":"IF(AY23=\"\",\"\",AY23)","v":""},null,{"$f":"IF($C23=\"\",\"\",$C23)","v":""},null,null,null,null,null,null,null,null,null,null,null,null,null,null,null,null,null,null,null,null,null,null,null,null,null,{"$f":"IF(Y23=\"\",\"\",IF(ISTEXT(Y23),Y23,SUM(Y23:AW23)))","v":""},null,null,{"$f":"IF($C23=\"\",\"\",$C23)","v":""},null,null,null,{"$f":"IF(ISBLANK(BD23),\"\",BD23-BC23)","v":""},{"$f":"IF(ISBLANK(BD23),\"\",MINUTE(BE23))","v":""},{"$f":"IF(ISBLANK(BD23),\"\",SECOND(BE23))","v":""},null,{"$f":"IF(K23=\"\",\"\",IF(ISTEXT(K23),K23,IF(K23>Basis!$N$9,\"Uit\",IF(ISBLANK(L23),K23,K23+L23))))","v":""},{"$f":"IF(OR(ISTEXT(J23),BI23=\"\"),J23,IF(ISTEXT(BI23),BI23,J23+BI23))","v":""},{"$f":"IF(N23=\"\",\"\",N23*60+O23)","v":""},{"$f":"IF(N23=\"\",\"\",IF(BK23<=Basis!$F$9,0,(BK23-Basis!$F$9)*0.4))","v":""},{"$f":"IF(N23=\"\",\"\",IF(BK23>Basis!$G$9,0,(Basis!$G$9-BK23)*0.4))","v":""},{"$f":"IF(M23=\"\",\"\",IF(ISTEXT(M23),M23,IF(ISTEXT(P23),P23,M23+P23)))","v":""}]
[null,null,null,null,null,null,null,null,null,{"$f":"IF(H24=\"\",\"\",IF(ISTEXT(H24),H24,IF(I24=\"\",\"\",IF((H24+I24)/2<=Basis!$M$9,\"Uit\",(100-((H24+I24)/2/Basis!$L$9*100))*Basis!$Y$6))))","v":""},null,null,"","","",{"$f":"IF(N24=\"\",\"\",IF(N24*60+O24>Basis!$U$9,\"Uit\",BL24+BM24))","v":""},null,"",null,null,"","",null,"",null,null,null,null,null,null,null,null,null,null,null,null,null,null,null,null,null,null,null,null,null,null,null,null,null,"",null,null,"",null,null,null,"","","",null,{"$f":"IF(K24=\"\",\"\",IF(ISTEXT(K24),K24,IF(K24>Basis!$N$9,\"Uit\",IF(ISBLANK(L24),K24,K24+L24))))","v":""},"","",{"$f":"IF(N24=\"\",\"\",IF(BK24<=Basis!$F$9,0,(BK24-Basis!$F$9)*0.4))","v":""},{"$f":"IF(N24=\"\",\"\",IF(BK24>Basis!$G$9,0,(Basis!$G$9-BK24)*0.4))","v":""},""]
[null,null,null,null,null,null,null,null,null,{"$f":"IF(H25=\"\",\"\",IF(ISTEXT(H25),H25,IF(I25=\"\",\"\",IF((H25+I25)/2<=Basis!$M$9,\"Uit\",(100-((H25+I25)/2/Basis!$L$9*100))*Basis!$Y$6))))","v":""},null,null,"","","",{"$f":"IF(N25=\"\",\"\",IF(N25*60+O25>Basis!$U$9,\"Uit\",BL25+BM25))","v":""},null,"",null,null,"","",null,"",null,null,null,null,null,null,null,null,null,null,null,null,null,null,null,null,null,null,null,null,null,null,null,null,null,"",null,null,"",null,null,null,"","","",null,{"$f":"IF(K25=\"\",\"\",IF(ISTEXT(K25),K25,IF(K25>Basis!$N$9,\"Uit\",IF(ISBLANK(L25),K25,K25+L25))))","v":""},"","",{"$f":"IF(N25=\"\",\"\",IF(BK25<=Basis!$F$9,0,(BK25-Basis!$F$9)*0.4))","v":""},{"$f":"IF(N25=\"\",\"\",IF(BK25>Basis!$G$9,0,(Basis!$G$9-BK25)*0.4))","v":""},""]
[null,null,null,null,null,null,null,null,null,{"$f":"IF(H26=\"\",\"\",IF(ISTEXT(H26),H26,IF(I26=\"\",\"\",IF((H26+I26)/2<=Basis!$M$9,\"Uit\",(100-((H26+I26)/2/Basis!$L$9*100))*Basis!$Y$6))))","v":""},null,null,"","","",{"$f":"IF(N26=\"\",\"\",IF(N26*60+O26>Basis!$U$9,\"Uit\",BL26+BM26))","v":""},null,"",null,null,"","",null,"",null,null,null,null,null,null,null,null,null,null,null,null,null,null,null,null,null,null,null,null,null,null,null,null,null,"",null,null,"",null,null,null,"","","",null,{"$f":"IF(K26=\"\",\"\",IF(ISTEXT(K26),K26,IF(K26>Basis!$N$9,\"Uit\",IF(ISBLANK(L26),K26,K26+L26))))","v":""},"","",{"$f":"IF(N26=\"\",\"\",IF(BK26<=Basis!$F$9,0,(BK26-Basis!$F$9)*0.4))","v":""},{"$f":"IF(N26=\"\",\"\",IF(BK26>Basis!$G$9,0,(Basis!$G$9-BK26)*0.4))","v":""},""]
[null,null,null,null,null,null,null,null,null,{"$f":"IF(H27=\"\",\"\",IF(ISTEXT(H27),H27,IF(I27=\"\",\"\",IF((H27+I27)/2<=Basis!$M$9,\"Uit\",(100-((H27+I27)/2/Basis!$L$9*100))*Basis!$Y$6))))","v":""},null,null,"","","",{"$f":"IF(N27=\"\",\"\",IF(N27*60+O27>Basis!$U$9,\"Uit\",BL27+BM27))","v":""},null,"",null,null,"","",null,"",null,null,null,null,null,null,null,null,null,null,null,null,null,null,null,null,null,null,null,null,null,null,null,null,null,"",null,null,"",null,null,null,"","","",null,{"$f":"IF(K27=\"\",\"\",IF(ISTEXT(K27),K27,IF(K27>Basis!$N$9,\"Uit\",IF(ISBLANK(L27),K27,K27+L27))))","v":""},"","",{"$f":"IF(N27=\"\",\"\",IF(BK27<=Basis!$F$9,0,(BK27-Basis!$F$9)*0.4))","v":""},{"$f":"IF(N27=\"\",\"\",IF(BK27>Basis!$G$9,0,(Basis!$G$9-BK27)*0.4))","v":""},""]
[null,null,null,null,null,null,null,null,null,{"$f":"IF(H28=\"\",\"\",IF(ISTEXT(H28),H28,IF(I28=\"\",\"\",IF((H28+I28)/2<=Basis!$M$9,\"Uit\",(100-((H28+I28)/2/Basis!$L$9*100))*Basis!$Y$6))))","v":""},null,null,{"$f":"IF(AX28=\"\",\"\",AX28)","v":""},{"$f":"IF(ISBLANK(BD28),\"\",BF28)","v":""},{"$f":"IF(ISBLANK(BD28),\"\",BG28)","v":""},{"$f":"IF(N28=\"\",\"\",IF(N28*60+O28>Basis!$U$9,\"Uit\",BL28+BM28))","v":""},null,{"$f":"IF(ISTEXT(BJ28),BJ28,IF(OR(ISBLANK(M28),M28=\"\",ISBLANK(Y28)),BJ28,IF(ISTEXT(BN28),BN28,BJ28+BN28)))","v":""},null,null,{"$f":"IF(R28=\"\",\"\",IF(ISTEXT(R28),R28,R28-S28-T28))","v":""},{"$f":"IF(AY28=\"\",\"\",AY28)","v":""},null,"",null,null,null,null,null,null,null,null,null,null,null,null,null,null,null,null,null,null,null,null,null,null,null,null,null,{"$f":"IF(Y28=\"\",\"\",IF(ISTEXT(Y28),Y28,SUM(Y28:AW28)))","v":""},null,null,"",null,null,null,{"$f":"IF(ISBLANK(BD28),\"\",BD28-BC28)","v":""},{"$f":"IF(ISBLANK(BD28),\"\",MINUTE(BE28))","v":""},{"$f":"IF(ISBLANK(BD28),\"\",SECOND(BE28))","v":""},null,{"$f":"IF(K28=\"\",\"\",IF(ISTEXT(K28),K28,IF(K28>Basis!$N$9,\"Uit\",IF(ISBLANK(L28),K28,K28+L28))))","v":""},{"$f":"IF(OR(ISTEXT(J28),BI28=\"\"),J28,IF(ISTEXT(BI28),BI28,J28+BI28))","v":""},{"$f":"IF(N28=\"\",\"\",N28*60+O28)","v":""},{"$f":"IF(N28=\"\",\"\",IF(BK28<=Basis!$F$9,0,(BK28-Basis!$F$9)*0.4))","v":""},{"$f":"IF(N28=\"\",\"\",IF(BK28>Basis!$G$9,0,(Basis!$G$9-BK28)*0.4))","v":""},{"$f":"IF(M28=\"\",\"\",IF(ISTEXT(M28),M28,IF(ISTEXT(P28),P28,M28+P28)))","v":""}]
["  Bij uitsluiting reden vermelden : ",null,null,null,null,null,null,null,null,null,null,null,null,null,null,{"$f":"NOW()","v":"2018-06-30T22:02:24.880"},null,null,null,null,null,null,null,{"$f":"A29","v":"  Bij uitsluiting reden vermelden : "},null,null,null,null,null,null,null,null,null,null,null,null,null,null,null,null,null,null,null,null,null,null,{"$f":"NOW()","v":"2018-06-30T22:02:24.880"}]
["  VP=val paard, VR=val ruiter, 3W=3 weigeringen op zelfde hindernis, 4W=4 weigeringen totaal, FP=foutief parcours, Vr.v= vrijwillig verlaten",null,null,null,null,null,null,null,null,null,null,null,null,null,null,null,null,null,null,null,null,null,null,{"$f":"A30","v":"  VP=val paard, VR=val ruiter, 3W=3 weigeringen op zelfde hindernis, 4W=4 weigeringen totaal, FP=foutief parcours, Vr.v= vrijwillig verlaten"}]

{"sheet":"Ring 2 M-CDE","index":9,"n_rows":21,"n_cols":66,"rows_kept":21,"cut":false,"hidden":false,"merged":[[2,13,2,14],[19,15,19,21],[19,46,19,52]]}
[{"$f":"\" Samengestelde wedstrijd \"&Basis!D18","v":" Samengestelde wedstrijd Eventing Leende 30 juni 2018"},null,null,null,null,null,"Klasse M - Cat CDE - Ring 2",null,null,null,null,"Dressuurjury : ","Martine van Winden",null,null,null,null,null,null,null,null,null,null," Verzamelstaat hindernisfouten in de cross",null,null,null,null,null,null,null,null,null,null,null,null,{"$f":"A1","v":" Samengestelde wedstrijd Eventing Leende 30 juni 2018"},null,null,null,null,null,null,null,null,null,null,null,null,null,null,null,{"$f":"G1&\" \"","v":"Klasse M - Cat CDE - Ring 2 "},null," Indien aankomstUUR cross wordt meegedeeld :",null,null,null,null,null," Hulpkolommen"]
["rank","pony","rugnr","combinatie nr","naam ruiter","naam pony","vereniging / plaats",null,"dressuur","dressuur","hind.ft.","tijd.ft.","hind.ft.","min","sec","tijd.ft.",null,"totaal","(1) stijl","(2) stijl","eind-","reden",null,null,"hindernisnummer",null,null,null,null,null,null,null,null,null,null,null,null,null,null,null,null,null,null,null,null,null,null,null,null,null," ",null,null,null,null,null,null,null,null,null,"Uitslag","NA","tijd (sec)","tijd.ft.","reg.ft.","totaal"]
["HC","cat.",null,null,null,null,null,null,"totaal","strafpntn.","springen","springen","cross","cross",null,{"$f":"Basis!$H$26&\":\"&TEXT(Basis!$I$26,\"00\")","v":"4:15"},null,null,"cijfer","cijfer","totaal","uitsluiting",null,"nr",1,2,3,"4ab",5,6,7,8,9,10,11,12,13,14,15,"VD","16ab","VD",17,"F",null,null,null,null,null,"totaal","reden uitsluiting","hind.","nr",null,"Vertrekuur","Aankomst","Tijd","Minuten","Seconden",null,"Springen","Springen","cross","opt.tijd =",{"$f":"Basis!$H$26&\":\"&TEXT(Basis!$I$26,\"00\")","v":"4:15"},"cross"]
[null,null,null,null,null,null,null,null,null,null,null,null,null,null,null,null,null,{"$f":"IF(ISBLANK(I4),\"\",IF(AND(ISBLANK(K4),ISBLANK(Y4)),J4,IF(ISTEXT(K4),K4,IF(OR(ISBLANK(M4),M4=\"\"),J4+K4+L4,IF(ISTEXT(M4),M4,IF(ISBLANK(Y4),J4+K4+L4,J4+K4+L4+M4+P4+Q4))))))","v":""}]
[1,"D",106,"824433SS","Jill Streppel","Schanebroek's Chubby Lee","PC. PPSV. Bussloo",null,199,{"$f":"IF(I5=\"\",\"\",IF(ISTEXT(I5),I5,IF(I5<=Basis!$M$26,\"Uit\",(100-(I5/Basis!$L$26*100))*Basis!$Y$19)))","v":33.666666666666671},0,0,{"$f":"IF(AX5=\"\",\"\",AX5)","v":0},{"$f":"IF(ISBLANK(BD5),\"\",BF5)","v":4},{"$f":"IF(ISBLANK(BD5),\"\",BG5)","v":19},{"$f":"IF(N5=\"\",\"\",IF(N5*60+O5>Basis!$U$26,\"Uit\",BL5+BM5))","v":1.6},null,{"$f":"IF(ISTEXT(BJ5),BJ5,IF(OR(ISBLANK(M5),M5=\"\",ISBLANK(Y5)),BJ5,IF(ISTEXT(BN5),BN5,BJ5+BN5)))","v":35.266666666666673},null,null,{"$f":"IF(R5=\"\",\"\",IF(ISTEXT(R5),R5,R5-S5-T5))","v":35.266666666666673},{"$f":"IF(AY5=\"\",\"\",AY5)","v":""},null,{"$f":"IF($C5=\"\",\"\",$C5)","v":106},0,"-","-","-","-","-","-","-","-","-","-","-","-","-","-","-","-","-","-","-",null,null,null,null,null,{"$f":"IF(Y5=\"\",\"\",IF(ISTEXT(Y5),Y5,SUM(Y5:AW5)))","v":0},null,null,{"$f":"IF($C5=\"\",\"\",$C5)","v":106},null,"13:34:00","13:38:19",{"$f":"IF(ISBLANK(BD5),\"\",BD5-BC5)","v":"00:04:19"},{"$f":"IF(ISBLANK(BD5),\"\",MINUTE(BE5))","v":4},{"$f":"IF(ISBLANK(BD5),\"\",SECOND(BE5))","v":19},null,{"$f":"IF(K5=\"\",\"\",IF(ISTEXT(K5),K5,IF(K5>Basis!$N$26,\"Uit\",IF(ISBLANK(L5),K5,K5+L5))))","v":0},{"$f":"IF(OR(ISTEXT(J5),BI5=\"\"),J5,IF(ISTEXT(BI5),BI5,J5+BI5))","v":33.666666666666671},{"$f":"IF(N5=\"\",\"\",N5*60+O5)","v":259},{"$f":"IF(N5=\"\",\"\",IF(BK5<=Basis!$F$26,0,(BK5-Basis!$F$26)*0.4))","v":1.6},{"$f":"IF(N5=\"\",\"\",IF(BK5>Basis!$G$26,0,(Basis!$G$26-BK5)*0.4))","v":0},{"$f":"IF(M5=\"\",\"\",IF(ISTEXT(M5),M5,IF(ISTEXT(P5),P5,M5+P5)))","v":1.6}]
[2,"D",107,"807412MB","Merle Bloem","Mernie","PC. Isidorusruiters",null,188.5,{"$f":"IF(I6=\"\",\"\",IF(ISTEXT(I6),I6,IF(I6<=Basis!$M$26,\"Uit\",(100-(I6/Basis!$L$26*100))*Basis!$Y$19)))","v":37.166666666666671},0,0,0,4,14,{"$f":"IF(N6=\"\",\"\",IF(N6*60+O6>Basis!$U$26,\"Uit\",BL6+BM6))","v":0},null,37.166666666666671,null,null,37.166666666666671,"",null,107,0,"-","-","-","-","-","-","-","-","-","-","-","-","-","-","-","-","-","-","-",null,null,null,null,null,0,null,null,107,null,"13:36:00","13:40:14","00:04:14",4,14,null,{"$f":"IF(K6=\"\",\"\",IF(ISTEXT(K6),K6,IF(K6>Basis!$N$26,\"Uit\",IF(ISBLANK(L6),K6,K6+L6))))","v":0},37.166666666666671,254,{"$f":"IF(N6=\"\",\"\",IF(BK6<=Basis!$F$26,0,(BK6-Basis!$F$26)*0.4))","v":0},{"$f":"IF(N6=\"\",\"\",IF(BK6>Basis!$G$26,0,(Basis!$G$26-BK6)*0.4))","v":0},0]
[3,"D",101,"823142WB","Puck Buijnsters","Wielbraek's Ingaro","PC. De Cavalieren",null,206.5,{"$f":"IF(I7=\"\",\"\",IF(ISTEXT(I7),I7,IF(I7<=Basis!$M$26,\"Uit\",(100-(I7/Basis!$L$26*100))*Basis!$Y$19)))","v":31.166666666666671},0,0,0,4,47,{"$f":"IF(N7=\"\",\"\",IF(N7*60+O7>Basis!$U$26,\"Uit\",BL7+BM7))","v":12.8},null,43.966666666666669,null,null,43.966666666666669,"",null,101,0,"-","-","-","-","-","-","-","-","-","-","-","-","-","-","-","-","-","-","-",null,null,null,null,null,0,null,null,101,null,"13:24:00","13:28:47","00:04:47",4,47,null,{"$f":"IF(K7=\"\",\"\",IF(ISTEXT(K7),K7,IF(K7>Basis!$N$26,\"Uit\",IF(ISBLANK(L7),K7,K7+L7))))","v":0},31.166666666666671,287,{"$f":"IF(N7=\"\",\"\",IF(BK7<=Basis!$F$26,0,(BK7-Basis!$F$26)*0.4))","v":12.8},{"$f":"IF(N7=\"\",\"\",IF(BK7>Basis!$G$26,0,(Basis!$G$26-BK7)*0.4))","v":0},12.8]
[4,"D",111,"756598NH","Senna van Houte","Naughty Boy",null,null,164.5,{"$f":"IF(I8=\"\",\"\",IF(ISTEXT(I8),I8,IF(I8<=Basis!$M$26,\"Uit\",(100-(I8/Basis!$L$26*100))*Basis!$Y$19)))","v":45.166666666666664},0,0,0,3,43,{"$f":"IF(N8=\"\",\"\",IF(N8*60+O8>Basis!$U$26,\"Uit\",BL8+BM8))","v":1.2000000000000002},null,46.366666666666667,null,null,46.366666666666667,"",null,111,0,"-","-","-","-","-","-","-","-","-","-","-","-","-","-","-","-","-","-","-",null,null,null,null,null,0,null,null,111,null,"14:12:00","14:15:43","00:03:43",3,43,null,{"$f":"IF(K8=\"\",\"\",IF(ISTEXT(K8),K8,IF(K8>Basis!$N$25,\"Uit\",IF(ISBLANK(L8),K8,K8+L8))))","v":0},45.166666666666664,223,{"$f":"IF(N8=\"\",\"\",IF(BK8<=Basis!$F$25,0,(BK8-Basis!$F$25)*0.4))","v":1.2000000000000002},{"$f":"IF(N8=\"\",\"\",IF(BK8>Basis!$G$25,0,(Basis!$G$25-BK8)*0.4))","v":0},1.2000000000000002]
[5,"D",104,"778641SS","Audrey Smits","Shanouk S","PC. De Duinrakkertjes",null,182,{"$f":"IF(I9=\"\",\"\",IF(ISTEXT(I9),I9,IF(I9<=Basis!$M$26,\"Uit\",(100-(I9/Basis!$L$26*100))*Basis!$Y$19)))","v":39.333333333333329},4,0,0,4,29,{"$f":"IF(N9=\"\",\"\",IF(N9*60+O9>Basis!$U$26,\"Uit\",BL9+BM9))","v":5.6000000000000005},null,48.93333333333333,null,null,48.93333333333333,"",null,104,0,"-","-","-","-","-","-","-","-","-","-","-","-","-","-","-","-","-","-","-",null,null,null,null,null,0,null,null,104,null,"13:30:00","13:34:29","00:04:29",4,29,null,{"$f":"IF(K9=\"\",\"\",IF(ISTEXT(K9),K9,IF(K9>Basis!$N$26,\"Uit\",IF(ISBLANK(L9),K9,K9+L9))))","v":4},43.333333333333329,269,{"$f":"IF(N9=\"\",\"\",IF(BK9<=Basis!$F$26,0,(BK9-Basis!$F$26)*0.4))","v":5.6000000000000005},{"$f":"IF(N9=\"\",\"\",IF(BK9>Basis!$G$26,0,(Basis!$G$26-BK9)*0.4))","v":0},5.6000000000000005]
[6,"D",103,"681487BP","Coen Philipsen","Bianca","PC. St. Jan Merselo",null,169,{"$f":"IF(I10=\"\",\"\",IF(ISTEXT(I10),I10,IF(I10<=Basis!$M$26,\"Uit\",(100-(I10/Basis!$L$26*100))*Basis!$Y$19)))","v":43.666666666666664},0,0,40,4,39,{"$f":"IF(N10=\"\",\"\",IF(N10*60+O10>Basis!$U$26,\"Uit\",BL10+BM10))","v":9.6000000000000014},null,93.266666666666666,null,null,93.266666666666666,"",null,103,20,20,"-","-","-","-","-","-","-","-","-","-","-","-","-","-","-","-","-","-",null,null,null,null,null,40,null,null,103,null,"13:28:00","13:32:39","00:04:39",4,39,null,{"$f":"IF(K10=\"\",\"\",IF(ISTEXT(K10),K10,IF(K10>Basis!$N$26,\"Uit\",IF(ISBLANK(L10),K10,K10+L10))))","v":0},43.666666666666664,279,{"$f":"IF(N10=\"\",\"\",IF(BK10<=Basis!$F$26,0,(BK10-Basis!$F$26)*0.4))","v":9.6000000000000014},{"$f":"IF(N10=\"\",\"\",IF(BK10>Basis!$G$26,0,(Basis!$G$26-BK10)*0.4))","v":0},49.6]
[7,"D",105,"766977AB","Marieke de Bruijn","Annabel de L'eguille","PC. De Bosruiterkes",null,204.5,{"$f":"IF(I11=\"\",\"\",IF(ISTEXT(I11),I11,IF(I11<=Basis!$M$26,\"Uit\",(100-(I11/Basis!$L$26*100))*Basis!$Y$19)))","v":31.833333333333343},0,0,40,5,42,{"$f":"IF(N11=\"\",\"\",IF(N11*60+O11>Basis!$U$26,\"Uit\",BL11+BM11))","v":34.800000000000004},null,106.63333333333335,null,null,106.63333333333335,"",null,105,0,"-","-","-","-","-","-","-",20,"-","-","-","-","-","-","-",20,"-","-","-",null,null,null,null,null,40,null,null,105,null,"13:32:00","13:37:42","00:05:42",5,42,null,{"$f":"IF(K11=\"\",\"\",IF(ISTEXT(K11),K11,IF(K11>Basis!$N$26,\"Uit\",IF(ISBLANK(L11),K11,K11+L11))))","v":0},31.833333333333343,342,{"$f":"IF(N11=\"\",\"\",IF(BK11<=Basis!$F$26,0,(BK11-Basis!$F$26)*0.4))","v":34.800000000000004},{"$f":"IF(N11=\"\",\"\",IF(BK11>Basis!$G$26,0,(Basis!$G$26-BK11)*0.4))","v":0},74.800000000000011]
[null,"D",102,"808797GJ","Caya Jochems","Goudlokje","PC. De Voornruiters",null,178.5,{"$f":"IF(I12=\"\",\"\",IF(ISTEXT(I12),I12,IF(I12<=Basis!$M$26,\"Uit\",(100-(I12/Basis!$L$26*100))*Basis!$Y$19)))","v":40.5},"4W",null,"NG","","",{"$f":"IF(N12=\"\",\"\",IF(N12*60+O12>Basis!$U$26,\"Uit\",BL12+BM12))","v":""},null,"4W",null,null,"Uit","4W spr.",null,102,"NG",null,null,null,null,null,null,null,null,null,null,null,null,null,null,null,null,null,null,null,null,null,null,null,null,"NG",null,null,102,null,"13:26:00",null,"","","",null,{"$f":"IF(K12=\"\",\"\",IF(ISTEXT(K12),K12,IF(K12>Basis!$N$26,\"Uit\",IF(ISBLANK(L12),K12,K12+L12))))","v":"4W"},"4W","",{"$f":"IF(N12=\"\",\"\",IF(BK12<=Basis!$F$26,0,(BK12-Basis!$F$26)*0.4))","v":""},{"$f":"IF(N12=\"\",\"\",IF(BK12>Basis!$G$26,0,(Basis!$G$26-BK12)*0.4))","v":""},"NG"]
[null,"D",108,"840481HW","Sophie Weening","Hip Hop","PC. 't Reelaer (hsv.)",null,196.5,{"$f":"IF(I13=\"\",\"\",IF(ISTEXT(I13),I13,IF(I13<=Basis!$M$26,\"Uit\",(100-(I13/Basis!$L$26*100))*Basis!$Y$19)))","v":34.5},"VR",null,"NG","","",{"$f":"IF(N13=\"\",\"\",IF(N13*60+O13>Basis!$U$26,\"Uit\",BL13+BM13))","v":""},null,"VR",null,null,"Uit","VR spr.",null,108,"NG",null,null,null,null,null,null,null,null,null,null,null,null,null,null,null,null,null,null,null,null,null,null,null,null,"NG",null,null,108,null,"13:38:00",null,"","","",null,{"$f":"IF(K13=\"\",\"\",IF(ISTEXT(K13),K13,IF(K13>Basis!$N$26,\"Uit\",IF(ISBLANK(L13),K13,K13+L13))))","v":"VR"},"VR","",{"$f":"IF(N13=\"\",\"\",IF(BK13<=Basis!$F$26,0,(BK13-Basis!$F$26)*0.4))","v":""},{"$f":"IF(N13=\"\",\"\",IF(BK13>Basis!$G$26,0,(Basis!$G$26-BK13)*0.4))","v":""},"NG"]
[null,"D",109,null,null,null,null,null,null,{"$f":"IF(I14=\"\",\"\",IF(ISTEXT(I14),I14,IF(I14<=Basis!$M$26,\"Uit\",(100-(I14/Basis!$L$26*100))*Basis!$Y$19)))","v":""},null,null,"","","",{"$f":"IF(N14=\"\",\"\",IF(N14*60+O14>Basis!$U$26,\"Uit\",BL14+BM14))","v":""},null,"",null,null,{"$f":"IF(R14=\"\",\"\",IF(ISTEXT(R14),R14,R14-S14-T14))","v":""},{"$f":"IF(AY14=\"\",\"\",AY14)","v":""},null,109,null,null,null,null,null,null,null,null,null,null,null,null,null,null,null,null,null,null,null,null,null,null,null,null,null,"",null,null,109,null,"13:40:00",null,"","","",null,{"$f":"IF(K14=\"\",\"\",IF(ISTEXT(K14),K14,IF(K14>Basis!$N$26,\"Uit\",IF(ISBLANK(L14),K14,K14+L14))))","v":""},"","",{"$f":"IF(N14=\"\",\"\",IF(BK14<=Basis!$F$26,0,(BK14-Basis!$F$26)*0.4))","v":""},{"$f":"IF(N14=\"\",\"\",IF(BK14>Basis!$G$26,0,(Basis!$G$26-BK14)*0.4))","v":""},""]
[null,null,null,null,null,null,null,null,null,{"$f":"IF(I15=\"\",\"\",IF(ISTEXT(I15),I15,IF(I15<=Basis!$M$26,\"Uit\",(100-(I15/Basis!$L$26*100))*Basis!$Y$19)))","v":""},null,null,{"$f":"IF(AX15=\"\",\"\",AX15)","v":""},{"$f":"IF(ISBLANK(BD15),\"\",BF15)","v":""},{"$f":"IF(ISBLANK(BD15),\"\",BG15)","v":""},{"$f":"IF(N15=\"\",\"\",IF(N15*60+O15>Basis!$U$26,\"Uit\",BL15+BM15))","v":""},null,{"$f":"IF(ISTEXT(BJ15),BJ15,IF(OR(ISBLANK(M15),M15=\"\",ISBLANK(Y15)),BJ15,IF(ISTEXT(BN15),BN15,BJ15+BN15)))","v":""},null,null,{"$f":"IF(R15=\"\",\"\",IF(ISTEXT(R15),R15,R15-S15-T15))","v":""},{"$f":"IF(AY15=\"\",\"\",AY15)","v":""},null,{"$f":"IF($C15=\"\",\"\",$C15)","v":""},null,null,null,null,null,null,null,null,null,null,null,null,null,null,null,null,null,null,null,null,null,null,null,null,null,{"$f":"IF(Y15=\"\",\"\",IF(ISTEXT(Y15),Y15,SUM(Y15:AW15)))","v":""},null,null,{"$f":"IF($C15=\"\",\"\",$C15)","v":""},null,null,null,{"$f":"IF(ISBLANK(BD15),\"\",BD15-BC15)","v":""},{"$f":"IF(ISBLANK(BD15),\"\",MINUTE(BE15))","v":""},{"$f":"IF(ISBLANK(BD15),\"\",SECOND(BE15))","v":""},null,{"$f":"IF(K15=\"\",\"\",IF(ISTEXT(K15),K15,IF(K15>Basis!$N$26,\"Uit\",IF(ISBLANK(L15),K15,K15+L15))))","v":""},{"$f":"IF(OR(ISTEXT(J15),BI15=\"\"),J15,IF(ISTEXT(BI15),BI15,J15+BI15))","v":""},{"$f":"IF(N15=\"\",\"\",N15*60+O15)","v":""},{"$f":"IF(N15=\"\",\"\",IF(BK15<=Basis!$F$26,0,(BK15-Basis!$F$26)*0.4))","v":""},{"$f":"IF(N15=\"\",\"\",IF(BK15>Basis!$G$26,0,(Basis!$G$26-BK15)*0.4))","v":""},{"$f":"IF(M15=\"\",\"\",IF(ISTEXT(M15),M15,IF(ISTEXT(P15),P15,M15+P15)))","v":""}]
[null,null,null,null,null,null,null,null,null,{"$f":"IF(I16=\"\",\"\",IF(ISTEXT(I16),I16,IF(I16<=Basis!$M$26,\"Uit\",(100-(I16/Basis!$L$26*100))*Basis!$Y$19)))","v":""},null,null,"","","",{"$f":"IF(N16=\"\",\"\",IF(N16*60+O16>Basis!$U$26,\"Uit\",BL16+BM16))","v":""},null,"",null,null,"","",null,"",null,null,null,null,null,null,null,null,null,null,null,null,null,null,null,null,null,null,null,null,null,null,null,null,null,"",null,null,"",null,null,null,"","","",null,{"$f":"IF(K16=\"\",\"\",IF(ISTEXT(K16),K16,IF(K16>Basis!$N$26,\"Uit\",IF(ISBLANK(L16),K16,K16+L16))))","v":""},"","",{"$f":"IF(N16=\"\",\"\",IF(BK16<=Basis!$F$26,0,(BK16-Basis!$F$26)*0.4))","v":""},{"$f":"IF(N16=\"\",\"\",IF(BK16>Basis!$G$26,0,(Basis!$G$26-BK16)*0.4))","v":""},""]
[null,null,null,null,null,null,null,null,null,{"$f":"IF(I17=\"\",\"\",IF(ISTEXT(I17),I17,IF(I17<=Basis!$M$26,\"Uit\",(100-(I17/Basis!$L$26*100))*Basis!$Y$19)))","v":""},null,null,"","","",{"$f":"IF(N17=\"\",\"\",IF(N17*60+O17>Basis!$U$26,\"Uit\",BL17+BM17))","v":""},null,"",null,null,"","",null,"",null,null,null,null,null,null,null,null,null,null,null,null,null,null,null,null,null,null,null,null,null,null,null,null,null,"",null,null,"",null,null,null,"","","",null,{"$f":"IF(K17=\"\",\"\",IF(ISTEXT(K17),K17,IF(K17>Basis!$N$26,\"Uit\",IF(ISBLANK(L17),K17,K17+L17))))","v":""},"","",{"$f":"IF(N17=\"\",\"\",IF(BK17<=Basis!$F$26,0,(BK17-Basis!$F$26)*0.4))","v":""},{"$f":"IF(N17=\"\",\"\",IF(BK17>Basis!$G$26,0,(Basis!$G$26-BK17)*0.4))","v":""},""]
[null,null,null,null,null,null,null,null,null,{"$f":"IF(I18=\"\",\"\",IF(ISTEXT(I18),I18,IF(I18<=Basis!$M$26,\"Uit\",(100-(I18/Basis!$L$26*100))*Basis!$Y$19)))","v":""},null,null,"","","",{"$f":"IF(N18=\"\",\"\",IF(N18*60+O18>Basis!$U$26,\"Uit\",BL18+BM18))","v":""},null,"",null,null,"","",null,"",null,null,null,null,null,null,null,null,null,null,null,null,null,null,null,null,null,null,null,null,null,null,null,null,null,"",null,null,"",null,null,null,"","","",null,{"$f":"IF(K18=\"\",\"\",IF(ISTEXT(K18),K18,IF(K18>Basis!$N$26,\"Uit\",IF(ISBLANK(L18),K18,K18+L18))))","v":""},"","",{"$f":"IF(N18=\"\",\"\",IF(BK18<=Basis!$F$26,0,(BK18-Basis!$F$26)*0.4))","v":""},{"$f":"IF(N18=\"\",\"\",IF(BK18>Basis!$G$26,0,(Basis!$G$26-BK18)*0.4))","v":""},""]
[null,null,null,null,null,null,null,null,null,{"$f":"IF(I19=\"\",\"\",IF(ISTEXT(I19),I19,IF(I19<=Basis!$M$26,\"Uit\",(100-(I19/Basis!$L$26*100))*Basis!$Y$19)))","v":""},null,null,"","","",{"$f":"IF(N19=\"\",\"\",IF(N19*60+O19>Basis!$U$26,\"Uit\",BL19+BM19))","v":""},null,"",null,null,"","",null,"",null,null,null,null,null,null,null,null,null,null,null,null,null,null,null,null,null,null,null,null,null,null,null,null,null,"",null,null,"",null,null,null,"","","",null,{"$f":"IF(K19=\"\",\"\",IF(ISTEXT(K19),K19,IF(K19>Basis!$N$26,\"Uit\",IF(ISBLANK(L19),K19,K19+L19))))","v":""},"","",{"$f":"IF(N19=\"\",\"\",IF(BK19<=Basis!$F$26,0,(BK19-Basis!$F$26)*0.4))","v":""},{"$f":"IF(N19=\"\",\"\",IF(BK19>Basis!$G$26,0,(Basis!$G$26-BK19)*0.4))","v":""},""]
["  Bij uitsluiting reden vermelden : ",null,null,null,null,null,null,null,null,null,null,null,null,null,null,{"$f":"NOW()","v":"2018-06-30T22:02:24.880"},null,null,null,null,null,null,null,{"$f":"A20","v":"  Bij uitsluiting reden vermelden : "},null,null,null,null,null,null,null,null,null,null,null,null,null,null,null,null,null,null,null,null,null,null,{"$f":"NOW()","v":"2018-06-30T22:02:24.880"}]
["  VP=val paard, VR=val ruiter, 3W=3 weigeringen op zelfde hindernis, 4W=4 weigeringen totaal, FP=foutief parcours, Vr.v= vrijwillig verlaten",null,null,null,null,null,null,null,null,null,null,null,null,null,null,null,null,null,null,null,null,null,null,{"$f":"A21","v":"  VP=val paard, VR=val ruiter, 3W=3 weigeringen op zelfde hindernis, 4W=4 weigeringen totaal, FP=foutief parcours, Vr.v= vrijwillig verlaten"}]

{"sheet":"Paarden M","index":10,"n_rows":31,"n_cols":66,"rows_kept":31,"cut":false,"hidden":true,"merged":[[2,13,2,14],[29,15,29,21],[29,46,29,52]]}
[{"$f":"\" Samengestelde wedstrijd \"&Basis!D5","v":" Samengestelde wedstrijd Eventing Leende 30 juni 2018"},null,null,null,null,null,"Klasse M - Ring 3",null,null,null,"Dressuurjury : ",null,null,null,null,null,null,null,null,null,null,null,null," Verzamelstaat hindernisfouten in de cross",null,null,null,null,null,null,null,null,null,null,null,null,{"$f":"A1","v":" Samengestelde wedstrijd Eventing Leende 30 juni 2018"},null,null,null,null,null,null,null,null,null,null,null,null,null,null,null,{"$f":"G1&\" \"","v":"Klasse M - Ring 3 "},null," Indien aankomstUUR cross wordt meegedeeld :",null,null,null,null,null," Hulpkolommen"]
["rank",null,"rugnr","combinatie nr","naam ruiter","naam paard","vereniging / plaats",null,"dressuur","dressuur","hind.ft.","tijd.ft.","hind.ft.","min","sec","tijd.ft.",null,"totaal","(1) stijl","(2) stijl","eind-","reden",null,null,"hindernisnummer",null,null,null,null,null,null,null,null,null,null,null,null,null,null,null,null,null,null,null,null,null,null,null,null,null," ",null,null,null,null,null,null,null,null,null,"Uitslag","NA","tijd (sec)","tijd.ft.","reg.ft.","totaal"]
["HC",null,null,null,null,null,null,null,"totaal","strafpntn.","springen","springen","cross","cross",null,{"$f":"Basis!$H$10&\":\"&TEXT(Basis!$I$10,\"00\")","v":"4:36"},null,null,"cijfer","cijfer","totaal","uitsluiting",null,"nr",1,2,3,4,5,6,7,8,9,10,11,12,13,14,15,16,17,18,19,20,21,22,23,24,25,"totaal","reden uitsluiting","hind.","nr",null,"Vertrekuur","Aankomst","Tijd","Minuten","Seconden",null,"Springen","Springen","cross","opt.tijd =",{"$f":"Basis!$H$10&\":\"&TEXT(Basis!$I$10,\"00\")","v":"4:36"},"cross"]
[null,null,null,null,null,null,null,null,null,null,null,null,null,null,null,null,null,{"$f":"IF(ISBLANK(I4),\"\",IF(AND(ISBLANK(K4),ISBLANK(Y4)),J4,IF(ISTEXT(K4),K4,IF(OR(ISBLANK(M4),M4=\"\"),J4+K4+L4,IF(ISTEXT(M4),M4,IF(ISBLANK(Y4),J4+K4+L4,J4+K4+L4+M4+P4+Q4))))))","v":""}]
[null,null,1,null,null,null,null,null,null,{"$f":"IF(I5=\"\",\"\",IF(ISTEXT(I5),I5,IF(I5<=Basis!$M$10,\"Uit\",(100-(I5/Basis!$L$10*100))*Basis!$Y$6)))","v":""},null,null,{"$f":"IF(AX5=\"\",\"\",AX5)","v":""},{"$f":"IF(ISBLANK(BD5),\"\",BF5)","v":""},{"$f":"IF(ISBLANK(BD5),\"\",BG5)","v":""},{"$f":"IF(N5=\"\",\"\",IF(N5*60+O5>Basis!$U$10,\"Uit\",BL5+BM5))","v":""},null,{"$f":"IF(ISTEXT(BJ5),BJ5,IF(OR(ISBLANK(M5),M5=\"\",ISBLANK(Y5)),BJ5,IF(ISTEXT(BN5),BN5,BJ5+BN5)))","v":""},null,null,{"$f":"IF(R5=\"\",\"\",IF(ISTEXT(R5),R5,R5-S5-T5))","v":""},{"$f":"IF(AY5=\"\",\"\",AY5)","v":""},null,{"$f":"IF($C5=\"\",\"\",$C5)","v":1},null,"-","-","-","-","-","-","-","-","-","-","-","-","-","-","-","-","-","-","-","-","-","-","-","-",{"$f":"IF(Y5=\"\",\"\",IF(ISTEXT(Y5),Y5,SUM(Y5:AW5)))","v":""},null,null,{"$f":"IF($C5=\"\",\"\",$C5)","v":1},null,"10:00:00",null,{"$f":"IF(ISBLANK(BD5),\"\",BD5-BC5)","v":""},{"$f":"IF(ISBLANK(BD5),\"\",MINUTE(BE5))","v":""},{"$f":"IF(ISBLANK(BD5),\"\",SECOND(BE5))","v":""},null,{"$f":"IF(K5=\"\",\"\",IF(ISTEXT(K5),K5,IF(K5>Basis!$N$10,\"Uit\",IF(ISBLANK(L5),K5,K5+L5))))","v":""},{"$f":"IF(OR(ISTEXT(J5),BI5=\"\"),J5,IF(ISTEXT(BI5),BI5,J5+BI5))","v":""},{"$f":"IF(N5=\"\",\"\",N5*60+O5)","v":""},{"$f":"IF(N5=\"\",\"\",IF(BK5<=Basis!$F$10,0,(BK5-Basis!$F$10)*0.4))","v":""},{"$f":"IF(N5=\"\",\"\",IF(BK5>Basis!$G$10,0,(Basis!$G$10-BK5)*0.4))","v":""},{"$f":"IF(M5=\"\",\"\",IF(ISTEXT(M5),M5,IF(ISTEXT(P5),P5,M5+P5)))","v":""}]
[null,null,2,null,null,null,null,null,null,{"$f":"IF(I6=\"\",\"\",IF(ISTEXT(I6),I6,IF(I6<=Basis!$M$10,\"Uit\",(100-(I6/Basis!$L$10*100))*Basis!$Y$6)))","v":""},null,null,"","","",{"$f":"IF(N6=\"\",\"\",IF(N6*60+O6>Basis!$U$10,\"Uit\",BL6+BM6))","v":""},null,"",null,null,"","",null,2,null,"-","-","-","-","-","-","-","-","-","-","-","-","-","-","-","-","-","-","-","-","-","-","-","-","",null,null,2,null,"10:02:00",null,"","","",null,{"$f":"IF(K6=\"\",\"\",IF(ISTEXT(K6),K6,IF(K6>Basis!$N$10,\"Uit\",IF(ISBLANK(L6),K6,K6+L6))))","v":""},{"$f":"IF(OR(ISTEXT(J6),BI6=\"\"),J6,IF(ISTEXT(BI6),BI6,J6+BI6))","v":""},{"$f":"IF(N6=\"\",\"\",N6*60+O6)","v":""},{"$f":"IF(N6=\"\",\"\",IF(BK6<=Basis!$F$10,0,(BK6-Basis!$F$10)*0.4))","v":""},{"$f":"IF(N6=\"\",\"\",IF(BK6>Basis!$G$10,0,(Basis!$G$10-BK6)*0.4))","v":""},{"$f":"IF(M6=\"\",\"\",IF(ISTEXT(M6),M6,IF(ISTEXT(P6),P6,M6+P6)))","v":""}]
[null,null,3,null,null,null,null,null,null,{"$f":"IF(I7=\"\",\"\",IF(ISTEXT(I7),I7,IF(I7<=Basis!$M$10,\"Uit\",(100-(I7/Basis!$L$10*100))*Basis!$Y$6)))","v":""},null,null,"","","",{"$f":"IF(N7=\"\",\"\",IF(N7*60+O7>Basis!$U$10,\"Uit\",BL7+BM7))","v":""},null,"",null,null,"","",null,3,null,"-","-","-","-","-","-","-","-","-","-","-","-","-","-","-","-","-","-","-","-","-","-","-","-","",null,null,3,null,"10:04:00",null,"","","",null,{"$f":"IF(K7=\"\",\"\",IF(ISTEXT(K7),K7,IF(K7>Basis!$N$10,\"Uit\",IF(ISBLANK(L7),K7,K7+L7))))","v":""},"","",{"$f":"IF(N7=\"\",\"\",IF(BK7<=Basis!$F$10,0,(BK7-Basis!$F$10)*0.4))","v":""},{"$f":"IF(N7=\"\",\"\",IF(BK7>Basis!$G$10,0,(Basis!$G$10-BK7)*0.4))","v":""},""]
[null,null,4,null,null,null,null,null,null,{"$f":"IF(I8=\"\",\"\",IF(ISTEXT(I8),I8,IF(I8<=Basis!$M$10,\"Uit\",(100-(I8/Basis!$L$10*100))*Basis!$Y$6)))","v":""},null,null,"","","",{"$f":"IF(N8=\"\",\"\",IF(N8*60+O8>Basis!$U$10,\"Uit\",BL8+BM8))","v":""},null,"",null,null,"","",null,4,null,"-","-","-","-","-","-","-","-","-","-","-","-","-","-","-","-","-","-","-","-","-","-","-","-","",null,null,4,null,null,null,"","","",null,{"$f":"IF(K8=\"\",\"\",IF(ISTEXT(K8),K8,IF(K8>Basis!$N$10,\"Uit\",IF(ISBLANK(L8),K8,K8+L8))))","v":""},"","",{"$f":"IF(N8=\"\",\"\",IF(BK8<=Basis!$F$10,0,(BK8-Basis!$F$10)*0.4))","v":""},{"$f":"IF(N8=\"\",\"\",IF(BK8>Basis!$G$10,0,(Basis!$G$10-BK8)*0.4))","v":""},""]
[null,null,5,null,null,null,null,null,null,{"$f":"IF(I9=\"\",\"\",IF(ISTEXT(I9),I9,IF(I9<=Basis!$M$10,\"Uit\",(100-(I9/Basis!$L$10*100))*Basis!$Y$6)))","v":""},null,null,"","","",{"$f":"IF(N9=\"\",\"\",IF(N9*60+O9>Basis!$U$10,\"Uit\",BL9+BM9))","v":""},null,"",null,null,"","",null,5,null,"-","-","-","-","-","-","-","-","-","-","-","-","-","-","-","-","-","-","-","-","-","-","-","-","",null,null,5,null,null,null,"","","",null,{"$f":"IF(K9=\"\",\"\",IF(ISTEXT(K9),K9,IF(K9>Basis!$N$10,\"Uit\",IF(ISBLANK(L9),K9,K9+L9))))","v":""},"","",{"$f":"IF(N9=\"\",\"\",IF(BK9<=Basis!$F$10,0,(BK9-Basis!$F$10)*0.4))","v":""},{"$f":"IF(N9=\"\",\"\",IF(BK9>Basis!$G$10,0,(Basis!$G$10-BK9)*0.4))","v":""},""]
[null,null,6,null,null,null,null,null,null,{"$f":"IF(I10=\"\",\"\",IF(ISTEXT(I10),I10,IF(I10<=Basis!$M$10,\"Uit\",(100-(I10/Basis!$L$10*100))*Basis!$Y$6)))","v":""},null,null,"","","",{"$f":"IF(N10=\"\",\"\",IF(N10*60+O10>Basis!$U$10,\"Uit\",BL10+BM10))","v":""},null,"",null,null,"","",null,6,null,"-","-","-","-","-","-","-","-","-","-","-","-","-","-","-","-","-","-","-","-","-","-","-","-","",null,null,6,null,null,null,"","","",null,{"$f":"IF(K10=\"\",\"\",IF(ISTEXT(K10),K10,IF(K10>Basis!$N$10,\"Uit\",IF(ISBLANK(L10),K10,K10+L10))))","v":""},"","",{"$f":"IF(N10=\"\",\"\",IF(BK10<=Basis!$F$10,0,(BK10-Basis!$F$10)*0.4))","v":""},{"$f":"IF(N10=\"\",\"\",IF(BK10>Basis!$G$10,0,(Basis!$G$10-BK10)*0.4))","v":""},""]
[null,null,7,null,null,null,null,null,null,{"$f":"IF(I11=\"\",\"\",IF(ISTEXT(I11),I11,IF(I11<=Basis!$M$10,\"Uit\",(100-(I11/Basis!$L$10*100))*Basis!$Y$6)))","v":""},null,null,"","","",{"$f":"IF(N11=\"\",\"\",IF(N11*60+O11>Basis!$U$10,\"Uit\",BL11+BM11))","v":""},null,"",null,null,"","",null,7,null,"-","-","-","-","-","-","-","-","-","-","-","-","-","-","-","-","-","-","-","-","-","-","-","-","",null,null,7,null,null,null,"","","",null,{"$f":"IF(K11=\"\",\"\",IF(ISTEXT(K11),K11,IF(K11>Basis!$N$10,\"Uit\",IF(ISBLANK(L11),K11,K11+L11))))","v":""},"","",{"$f":"IF(N11=\"\",\"\",IF(BK11<=Basis!$F$10,0,(BK11-Basis!$F$10)*0.4))","v":""},{"$f":"IF(N11=\"\",\"\",IF(BK11>Basis!$G$10,0,(Basis!$G$10-BK11)*0.4))","v":""},""]
[null,null,8,null,null,null,null,null,null,{"$f":"IF(I12=\"\",\"\",IF(ISTEXT(I12),I12,IF(I12<=Basis!$M$10,\"Uit\",(100-(I12/Basis!$L$10*100))*Basis!$Y$6)))","v":""},null,null,"","","",{"$f":"IF(N12=\"\",\"\",IF(N12*60+O12>Basis!$U$10,\"Uit\",BL12+BM12))","v":""},null,"",null,null,"","",null,8,null,"-","-","-","-","-","-","-","-","-","-","-","-","-","-","-","-","-","-","-","-","-","-","-","-","",null,null,8,null,null,null,"","","",null,{"$f":"IF(K12=\"\",\"\",IF(ISTEXT(K12),K12,IF(K12>Basis!$N$10,\"Uit\",IF(ISBLANK(L12),K12,K12+L12))))","v":""},"","",{"$f":"IF(N12=\"\",\"\",IF(BK12<=Basis!$F$10,0,(BK12-Basis!$F$10)*0.4))","v":""},{"$f":"IF(N12=\"\",\"\",IF(BK12>Basis!$G$10,0,(Basis!$G$10-BK12)*0.4))","v":""},""]
[null,null,9,null,null,null,null,null,null,{"$f":"IF(I13=\"\",\"\",IF(ISTEXT(I13),I13,IF(I13<=Basis!$M$10,\"Uit\",(100-(I13/Basis!$L$10*100))*Basis!$Y$6)))","v":""},null,null,"","","",{"$f":"IF(N13=\"\",\"\",IF(N13*60+O13>Basis!$U$10,\"Uit\",BL13+BM13))","v":""},null,"",null,null,"","",null,9,null,"-","-","-","-","-","-","-","-","-","-","-","-","-","-","-","-","-","-","-","-","-","-","-","-","",null,null,9,null,null,null,"","","",null,{"$f":"IF(K13=\"\",\"\",IF(ISTEXT(K13),K13,IF(K13>Basis!$N$10,\"Uit\",IF(ISBLANK(L13),K13,K13+L13))))","v":""},"","",{"$f":"IF(N13=\"\",\"\",IF(BK13<=Basis!$F$10,0,(BK13-Basis!$F$10)*0.4))","v":""},{"$f":"IF(N13=\"\",\"\",IF(BK13>Basis!$G$10,0,(Basis!$G$10-BK13)*0.4))","v":""},""]
[null,null,10,null,null,null,null,null,null,{"$f":"IF(I14=\"\",\"\",IF(ISTEXT(I14),I14,IF(I14<=Basis!$M$10,\"Uit\",(100-(I14/Basis!$L$10*100))*Basis!$Y$6)))","v":""},null,null,"","","",{"$f":"IF(N14=\"\",\"\",IF(N14*60+O14>Basis!$U$10,\"Uit\",BL14+BM14))","v":""},null,"",null,null,"","",null,10,null,"-","-","-","-","-","-","-","-","-","-","-","-","-","-","-","-","-","-","-","-","-","-","-","-","",null,null,10,null,null,null,"","","",null,{"$f":"IF(K14=\"\",\"\",IF(ISTEXT(K14),K14,IF(K14>Basis!$N$10,\"Uit\",IF(ISBLANK(L14),K14,K14+L14))))","v":""},"","",{"$f":"IF(N14=\"\",\"\",IF(BK14<=Basis!$F$10,0,(BK14-Basis!$F$10)*0.4))","v":""},{"$f":"IF(N14=\"\",\"\",IF(BK14>Basis!$G$10,0,(Basis!$G$10-BK14)*0.4))","v":""},""]
[null,null,null,null,null,null,null,null,null,{"$f":"IF(I15=\"\",\"\",IF(ISTEXT(I15),I15,IF(I15<=Basis!$M$10,\"Uit\",(100-(I15/Basis!$L$10*100))*Basis!$Y$6)))","v":""},null,null,"","","",{"$f":"IF(N15=\"\",\"\",IF(N15*60+O15>Basis!$U$10,\"Uit\",BL15+BM15))","v":""},null,"",null,null,"","",null,"",null,"-","-","-","-","-","-","-","-","-","-","-","-","-","-","-","-","-","-","-","-","-","-","-","-","",null,null,"",null,null,null,"","","",null,{"$f":"IF(K15=\"\",\"\",IF(ISTEXT(K15),K15,IF(K15>Basis!$N$10,\"Uit\",IF(ISBLANK(L15),K15,K15+L15))))","v":""},"","",{"$f":"IF(N15=\"\",\"\",IF(BK15<=Basis!$F$10,0,(BK15-Basis!$F$10)*0.4))","v":""},{"$f":"IF(N15=\"\",\"\",IF(BK15>Basis!$G$10,0,(Basis!$G$10-BK15)*0.4))","v":""},""]
[null,null,null,null,null,null,null,null,null,{"$f":"IF(I16=\"\",\"\",IF(ISTEXT(I16),I16,IF(I16<=Basis!$M$10,\"Uit\",(100-(I16/Basis!$L$10*100))*Basis!$Y$6)))","v":""},null,null,"","","",{"$f":"IF(N16=\"\",\"\",IF(N16*60+O16>Basis!$U$10,\"Uit\",BL16+BM16))","v":""},null,"",null,null,"","",null,"",null,"-","-","-","-","-","-","-","-","-","-","-","-","-","-","-","-","-","-","-","-","-","-","-","-","",null,null,"",null,null,null,"","","",null,{"$f":"IF(K16=\"\",\"\",IF(ISTEXT(K16),K16,IF(K16>Basis!$N$10,\"Uit\",IF(ISBLANK(L16),K16,K16+L16))))","v":""},"","",{"$f":"IF(N16=\"\",\"\",IF(BK16<=Basis!$F$10,0,(BK16-Basis!$F$10)*0.4))","v":""},{"$f":"IF(N16=\"\",\"\",IF(BK16>Basis!$G$10,0,(Basis!$G$10-BK16)*0.4))","v":""},""]
[null,null,null,null,null,null,null,null,null,{"$f":"IF(I17=\"\",\"\",IF(ISTEXT(I17),I17,IF(I17<=Basis!$M$10,\"Uit\",(100-(I17/Basis!$L$10*100))*Basis!$Y$6)))","v":""},null,null,"","","",{"$f":"IF(N17=\"\",\"\",IF(N17*60+O17>Basis!$U$10,\"Uit\",BL17+BM17))","v":""},null,"",null,null,"","",null,"",null,"-","-","-","-","-","-","-","-","-","-","-","-","-","-","-","-","-","-","-","-","-","-","-","-","",null,null,"",null,null,null,"","","",null,{"$f":"IF(K17=\"\",\"\",IF(ISTEXT(K17),K17,IF(K17>Basis!$N$10,\"Uit\",IF(ISBLANK(L17),K17,K17+L17))))","v":""},"","",{"$f":"IF(N17=\"\",\"\",IF(BK17<=Basis!$F$10,0,(BK17-Basis!$F$10)*0.4))","v":""},{"$f":"IF(N17=\"\",\"\",IF(BK17>Basis!$G$10,0,(Basis!$G$10-BK17)*0.4))","v":""},""]
[null,null,null,null,null,null,null,null,null,{"$f":"IF(I18=\"\",\"\",IF(ISTEXT(I18),I18,IF(I18<=Basis!$M$10,\"Uit\",(100-(I18/Basis!$L$10*100))*Basis!$Y$6)))","v":""},null,null,"","","",{"$f":"IF(N18=\"\",\"\",IF(N18*60+O18>Basis!$U$10,\"Uit\",BL18+BM18))","v":""},null,"",null,null,"","",null,"",null,"-","-","-","-","-","-","-","-","-","-","-","-","-","-","-","-","-","-","-","-","-","-","-","-","",null,null,"",null,null,null,"","","",null,{"$f":"IF(K18=\"\",\"\",IF(ISTEXT(K18),K18,IF(K18>Basis!$N$10,\"Uit\",IF(ISBLANK(L18),K18,K18+L18))))","v":""},"","",{"$f":"IF(N18=\"\",\"\",IF(BK18<=Basis!$F$10,0,(BK18-Basis!$F$10)*0.4))","v":""},{"$f":"IF(N18=\"\",\"\",IF(BK18>Basis!$G$10,0,(Basis!$G$10-BK18)*0.4))","v":""},""]
[null,null,null,null,null,null,null,null,null,{"$f":"IF(I19=\"\",\"\",IF(ISTEXT(I19),I19,IF(I19<=Basis!$M$10,\"Uit\",(100-(I19/Basis!$L$10*100))*Basis!$Y$6)))","v":""},null,null,"","","",{"$f":"IF(N19=\"\",\"\",IF(N19*60+O19>Basis!$U$10,\"Uit\",BL19+BM19))","v":""},null,"",null,null,"","",null,"",null,"-","-","-","-","-","-","-","-","-","-","-","-","-","-","-","-","-","-","-","-","-","-","-","-","",null,null,"",null,null,null,"","","",null,{"$f":"IF(K19=\"\",\"\",IF(ISTEXT(K19),K19,IF(K19>Basis!$N$10,\"Uit\",IF(ISBLANK(L19),K19,K19+L19))))","v":""},"","",{"$f":"IF(N19=\"\",\"\",IF(BK19<=Basis!$F$10,0,(BK19-Basis!$F$10)*0.4))","v":""},{"$f":"IF(N19=\"\",\"\",IF(BK19>Basis!$G$10,0,(Basis!$G$10-BK19)*0.4))","v":""},""]
[null,null,null,null,null,null,null,null,null,{"$f":"IF(I20=\"\",\"\",IF(ISTEXT(I20),I20,IF(I20<=Basis!$M$10,\"Uit\",(100-(I20/Basis!$L$10*100))*Basis!$Y$6)))","v":""},null,null,"","","",{"$f":"IF(N20=\"\",\"\",IF(N20*60+O20>Basis!$U$10,\"Uit\",BL20+BM20))","v":""},null,"",null,null,"","",null,"",null,"-","-","-","-","-","-","-","-","-","-","-","-","-","-","-","-","-","-","-","-","-","-","-","-","",null,null,"",null,null,null,"","","",null,{"$f":"IF(K20=\"\",\"\",IF(ISTEXT(K20),K20,IF(K20>Basis!$N$10,\"Uit\",IF(ISBLANK(L20),K20,K20+L20))))","v":""},"","",{"$f":"IF(N20=\"\",\"\",IF(BK20<=Basis!$F$10,0,(BK20-Basis!$F$10)*0.4))","v":""},{"$f":"IF(N20=\"\",\"\",IF(BK20>Basis!$G$10,0,(Basis!$G$10-BK20)*0.4))","v":""},""]
[null,null,null,null,null,null,null,null,null,{"$f":"IF(I21=\"\",\"\",IF(ISTEXT(I21),I21,IF(I21<=Basis!$M$10,\"Uit\",(100-(I21/Basis!$L$10*100))*Basis!$Y$6)))","v":""},null,null,"","","",{"$f":"IF(N21=\"\",\"\",IF(N21*60+O21>Basis!$U$10,\"Uit\",BL21+BM21))","v":""},null,"",null,null,"","",null,"",null,"-","-","-","-","-","-","-","-","-","-","-","-","-","-","-","-","-","-","-","-","-","-","-","-","",null,null,"",null,null,null,"","","",null,{"$f":"IF(K21=\"\",\"\",IF(ISTEXT(K21),K21,IF(K21>Basis!$N$10,\"Uit\",IF(ISBLANK(L21),K21,K21+L21))))","v":""},"","",{"$f":"IF(N21=\"\",\"\",IF(BK21<=Basis!$F$10,0,(BK21-Basis!$F$10)*0.4))","v":""},{"$f":"IF(N21=\"\",\"\",IF(BK21>Basis!$G$10,0,(Basis!$G$10-BK21)*0.4))","v":""},""]
[null,null,null,null,null,null,null,null,null,{"$f":"IF(I22=\"\",\"\",IF(ISTEXT(I22),I22,IF(I22<=Basis!$M$10,\"Uit\",(100-(I22/Basis!$L$10*100))*Basis!$Y$6)))","v":""},null,null,"","","",{"$f":"IF(N22=\"\",\"\",IF(N22*60+O22>Basis!$U$10,\"Uit\",BL22+BM22))","v":""},null,"",null,null,"","",null,"",null,"-","-","-","-","-","-","-","-","-","-","-","-","-","-","-","-","-","-","-","-","-","-","-","-","",null,null,"",null,null,null,"","","",null,{"$f":"IF(K22=\"\",\"\",IF(ISTEXT(K22),K22,IF(K22>Basis!$N$10,\"Uit\",IF(ISBLANK(L22),K22,K22+L22))))","v":""},"","",{"$f":"IF(N22=\"\",\"\",IF(BK22<=Basis!$F$10,0,(BK22-Basis!$F$10)*0.4))","v":""},{"$f":"IF(N22=\"\",\"\",IF(BK22>Basis!$G$10,0,(Basis!$G$10-BK22)*0.4))","v":""},""]
[null,null,null,null,null,null,null,null,null,{"$f":"IF(I23=\"\",\"\",IF(ISTEXT(I23),I23,IF(I23<=Basis!$M$10,\"Uit\",(100-(I23/Basis!$L$10*100))*Basis!$Y$6)))","v":""},null,null,"","","",{"$f":"IF(N23=\"\",\"\",IF(N23*60+O23>Basis!$U$10,\"Uit\",BL23+BM23))","v":""},null,"",null,null,"","",null,"",null,"-","-","-","-","-","-","-","-","-","-","-","-","-","-","-","-","-","-","-","-","-","-","-","-","",null,null,"",null,null,null,"","","",null,{"$f":"IF(K23=\"\",\"\",IF(ISTEXT(K23),K23,IF(K23>Basis!$N$10,\"Uit\",IF(ISBLANK(L23),K23,K23+L23))))","v":""},"","",{"$f":"IF(N23=\"\",\"\",IF(BK23<=Basis!$F$10,0,(BK23-Basis!$F$10)*0.4))","v":""},{"$f":"IF(N23=\"\",\"\",IF(BK23>Basis!$G$10,0,(Basis!$G$10-BK23)*0.4))","v":""},""]
[null,null,null,null,null,null,null,null,null,{"$f":"IF(I24=\"\",\"\",IF(ISTEXT(I24),I24,IF(I24<=Basis!$M$10,\"Uit\",(100-(I24/Basis!$L$10*100))*Basis!$Y$6)))","v":""},null,null,"","","",{"$f":"IF(N24=\"\",\"\",IF(N24*60+O24>Basis!$U$10,\"Uit\",BL24+BM24))","v":""},null,"",null,null,"","",null,"",null,"-","-","-","-","-","-","-","-","-","-","-","-","-","-","-","-","-","-","-","-","-","-","-","-","",null,null,"",null,null,null,"","","",null,{"$f":"IF(K24=\"\",\"\",IF(ISTEXT(K24),K24,IF(K24>Basis!$N$10,\"Uit\",IF(ISBLANK(L24),K24,K24+L24))))","v":""},"","",{"$f":"IF(N24=\"\",\"\",IF(BK24<=Basis!$F$10,0,(BK24-Basis!$F$10)*0.4))","v":""},{"$f":"IF(N24=\"\",\"\",IF(BK24>Basis!$G$10,0,(Basis!$G$10-BK24)*0.4))","v":""},""]
[null,null,null,null,null,null,null,null,null,{"$f":"IF(I25=\"\",\"\",IF(ISTEXT(I25),I25,IF(I25<=Basis!$M$10,\"Uit\",(100-(I25/Basis!$L$10*100))*Basis!$Y$6)))","v":""},null,null,"","","",{"$f":"IF(N25=\"\",\"\",IF(N25*60+O25>Basis!$U$10,\"Uit\",BL25+BM25))","v":""},null,"",null,null,"","",null,"",null,"-","-","-","-","-","-","-","-","-","-","-","-","-","-","-","-","-","-","-","-","-","-","-","-","",null,null,"",null,null,null,"","","",null,{"$f":"IF(K25=\"\",\"\",IF(ISTEXT(K25),K25,IF(K25>Basis!$N$10,\"Uit\",IF(ISBLANK(L25),K25,K25+L25))))","v":""},"","",{"$f":"IF(N25=\"\",\"\",IF(BK25<=Basis!$F$10,0,(BK25-Basis!$F$10)*0.4))","v":""},{"$f":"IF(N25=\"\",\"\",IF(BK25>Basis!$G$10,0,(Basis!$G$10-BK25)*0.4))","v":""},""]
[null,null,null,null,null,null,null,null,null,{"$f":"IF(I26=\"\",\"\",IF(ISTEXT(I26),I26,IF(I26<=Basis!$M$10,\"Uit\",(100-(I26/Basis!$L$10*100))*Basis!$Y$6)))","v":""},null,null,"","","",{"$f":"IF(N26=\"\",\"\",IF(N26*60+O26>Basis!$U$10,\"Uit\",BL26+BM26))","v":""},null,"",null,null,"","",null,"",null,"-","-","-","-","-","-","-","-","-","-","-","-","-","-","-","-","-","-","-","-","-","-","-","-","",null,null,"",null,null,null,"","","",null,{"$f":"IF(K26=\"\",\"\",IF(ISTEXT(K26),K26,IF(K26>Basis!$N$10,\"Uit\",IF(ISBLANK(L26),K26,K26+L26))))","v":""},"","",{"$f":"IF(N26=\"\",\"\",IF(BK26<=Basis!$F$10,0,(BK26-Basis!$F$10)*0.4))","v":""},{"$f":"IF(N26=\"\",\"\",IF(BK26>Basis!$G$10,0,(Basis!$G$10-BK26)*0.4))","v":""},""]
[null,null,null,null,null,null,null,null,null,{"$f":"IF(I27=\"\",\"\",IF(ISTEXT(I27),I27,IF(I27<=Basis!$M$10,\"Uit\",(100-(I27/Basis!$L$10*100))*Basis!$Y$6)))","v":""},null,null,"","","",{"$f":"IF(N27=\"\",\"\",IF(N27*60+O27>Basis!$U$10,\"Uit\",BL27+BM27))","v":""},null,"",null,null,"","",null,"",null,"-","-","-","-","-","-","-","-","-","-","-","-","-","-","-","-","-","-","-","-","-","-","-","-","",null,null,"",null,null,null,"","","",null,{"$f":"IF(K27=\"\",\"\",IF(ISTEXT(K27),K27,IF(K27>Basis!$N$10,\"Uit\",IF(ISBLANK(L27),K27,K27+L27))))","v":""},"","",{"$f":"IF(N27=\"\",\"\",IF(BK27<=Basis!$F$10,0,(BK27-Basis!$F$10)*0.4))","v":""},{"$f":"IF(N27=\"\",\"\",IF(BK27>Basis!$G$10,0,(Basis!$G$10-BK27)*0.4))","v":""},""]
[null,null,null,null,null,null,null,null,null,{"$f":"IF(I28=\"\",\"\",IF(ISTEXT(I28),I28,IF(I28<=Basis!$M$10,\"Uit\",(100-(I28/Basis!$L$10*100))*Basis!$Y$6)))","v":""},null,null,"","","",{"$f":"IF(N28=\"\",\"\",IF(N28*60+O28>Basis!$U$10,\"Uit\",BL28+BM28))","v":""},null,"",null,null,"","",null,"",null,"-","-","-","-","-","-","-","-","-","-","-","-","-","-","-","-","-","-","-","-","-","-","-","-","",null,null,"",null,null,null,"","","",null,{"$f":"IF(K28=\"\",\"\",IF(ISTEXT(K28),K28,IF(K28>Basis!$N$10,\"Uit\",IF(ISBLANK(L28),K28,K28+L28))))","v":""},"","",{"$f":"IF(N28=\"\",\"\",IF(BK28<=Basis!$F$10,0,(BK28-Basis!$F$10)*0.4))","v":""},{"$f":"IF(N28=\"\",\"\",IF(BK28>Basis!$G$10,0,(Basis!$G$10-BK28)*0.4))","v":""},""]
[null,null,null,null,null,null,null,null,null,{"$f":"IF(I29=\"\",\"\",IF(ISTEXT(I29),I29,IF(I29<=Basis!$M$10,\"Uit\",(100-(I29/Basis!$L$10*100))*Basis!$Y$6)))","v":""},null,null,"","","",{"$f":"IF(N29=\"\",\"\",IF(N29*60+O29>Basis!$U$10,\"Uit\",BL29+BM29))","v":""},null,"",null,null,"","",null,"",null,"-","-","-","-","-","-","-","-","-","-","-","-","-","-","-","-","-","-","-","-","-","-","-","-","",null,null,"",null,null,null,"","","",null,{"$f":"IF(K29=\"\",\"\",IF(ISTEXT(K29),K29,IF(K29>Basis!$N$10,\"Uit\",IF(ISBLANK(L29),K29,K29+L29))))","v":""},"","",{"$f":"IF(N29=\"\",\"\",IF(BK29<=Basis!$F$10,0,(BK29-Basis!$F$10)*0.4))","v":""},{"$f":"IF(N29=\"\",\"\",IF(BK29>Basis!$G$10,0,(Basis!$G$10-BK29)*0.4))","v":""},""]
["  Bij uitsluiting reden vermelden : ",null,null,null,null,null,null,null,null,null,null,null,null,null,null,{"$f":"NOW()","v":"2018-06-30T22:02:24.880"},null,null,null,null,null,null,null,{"$f":"A30","v":"  Bij uitsluiting reden vermelden : "},null,null,null,null,null,null,null,null,null,null,null,null,null,null,null,null,null,null,null,null,null,null,{"$f":"NOW()","v":"2018-06-30T22:02:24.880"}]
["  VP=val paard, VR=val ruiter, 3W=3 weigeringen op zelfde hindernis, 4W=4 weigeringen totaal, FP=foutief parcours, Vr.v= vrijwillig verlaten",null,null,null,null,null,null,null,null,null,null,null,null,null,null,null,null,null,null,null,null,null,null,{"$f":"A31","v":"  VP=val paard, VR=val ruiter, 3W=3 weigeringen op zelfde hindernis, 4W=4 weigeringen totaal, FP=foutief parcours, Vr.v= vrijwillig verlaten"}]

{"sheet":"Paarden Z","index":11,"n_rows":31,"n_cols":66,"rows_kept":31,"cut":false,"hidden":true,"merged":[[2,13,2,14],[29,15,29,21],[29,46,29,52],[1,7,1,8]]}
[{"$f":"\" Samengestelde wedstrijd \"&Basis!D5","v":" Samengestelde wedstrijd Eventing Leende 30 juni 2018"},null,null,null,null,null,"Klasse Z - Ring 4",null,null,null,"Dressuurjury : ",null,null,null,null,null,null,null,null,null,null,null,null," Verzamelstaat hindernisfouten in de cross",null,null,null,null,null,null,null,null,null,null,null,null,{"$f":"A1","v":" Samengestelde wedstrijd Eventing Leende 30 juni 2018"},null,null,null,null,null,null,null,null,null,null,null,null,null,null,null,{"$f":"G1&\" \"","v":"Klasse Z - Ring 4 "},null," Indien aankomstUUR cross wordt meegedeeld :",null,null,null,null,null," Hulpkolommen"]
["rank",null,"rugnr","combinatie nr","naam ruiter","naam paard","vereniging / plaats","dressuur",null,"dressuur","hind.ft.","tijd.ft.","hind.ft.","min","sec","tijd.ft.",null,"totaal","(1) stijl","(2) stijl","eind-","reden",null,null,"hindernisnummer",null,null,null,null,null,null,null,null,null,null,null,null,null,null,null,null,null,null,null,null,null,null,null,null,null," ",null,null,null,null,null,null,null,null,null,"Uitslag","NA","tijd (sec)","tijd.ft.","reg.ft.","totaal"]
["HC",null,null,null,null,null,null,"Jury C","Jury 2","strafpntn.","springen","springen","cross","cross",null,{"$f":"Basis!$H$11&\":\"&TEXT(Basis!$I$11,\"00\")","v":"5:00"},null,null,"cijfer","cijfer","totaal","uitsluiting",null,"nr",1,2,3,4,5,6,7,8,9,10,11,12,13,14,15,16,17,18,19,20,21,22,23,24,25,"totaal","reden uitsluiting","hind.","nr",null,"Vertrekuur","Aankomst","Tijd","Minuten","Seconden",null,"Springen","Springen","cross","opt.tijd =",{"$f":"Basis!$H$11&\":\"&TEXT(Basis!$I$11,\"00\")","v":"5:00"},"cross"]
[null,null,null,null,null,null,null,null,null,null,null,null,null,null,null,null,null,{"$f":"IF(ISBLANK(I4),\"\",IF(AND(ISBLANK(K4),ISBLANK(Y4)),J4,IF(ISTEXT(K4),K4,IF(OR(ISBLANK(M4),M4=\"\"),J4+K4+L4,IF(ISTEXT(M4),M4,IF(ISBLANK(Y4),J4+K4+L4,J4+K4+L4+M4+P4+Q4))))))","v":""}]
[null,null,1,null,null,null,null,null,null,{"$f":"IF(H5=\"\",\"\",IF(ISTEXT(H5),H5,IF(I5=\"\",\"\",IF((H5+I5)/2<=Basis!$M$11,\"Uit\",(100-((H5+I5)/2/Basis!$L$11*100))*Basis!$Y$6))))","v":""},null,null,{"$f":"IF(AX5=\"\",\"\",AX5)","v":""},{"$f":"IF(ISBLANK(BD5),\"\",BF5)","v":""},{"$f":"IF(ISBLANK(BD5),\"\",BG5)","v":""},{"$f":"IF(N5=\"\",\"\",IF(N5*60+O5>Basis!$U$11,\"Uit\",BL5+BM5))","v":""},null,{"$f":"IF(ISTEXT(BJ5),BJ5,IF(OR(ISBLANK(M5),M5=\"\",ISBLANK(Y5)),BJ5,IF(ISTEXT(BN5),BN5,BJ5+BN5)))","v":""},null,null,{"$f":"IF(R5=\"\",\"\",IF(ISTEXT(R5),R5,R5-S5-T5))","v":""},{"$f":"IF(AY5=\"\",\"\",AY5)","v":""},null,{"$f":"IF($C5=\"\",\"\",$C5)","v":1},null,"-","-","-","-","-","-","-","-","-","-","-","-","-","-","-","-","-","-","-","-","-","-","-","-",{"$f":"IF(Y5=\"\",\"\",IF(ISTEXT(Y5),Y5,SUM(Y5:AW5)))","v":""},null,null,{"$f":"IF($C5=\"\",\"\",$C5)","v":1},null,"10:00:00",null,{"$f":"IF(ISBLANK(BD5),\"\",BD5-BC5)","v":""},{"$f":"IF(ISBLANK(BD5),\"\",MINUTE(BE5))","v":""},{"$f":"IF(ISBLANK(BD5),\"\",SECOND(BE5))","v":""},null,{"$f":"IF(K5=\"\",\"\",IF(ISTEXT(K5),K5,IF(K5>Basis!$N$11,\"Uit\",IF(ISBLANK(L5),K5,K5+L5))))","v":""},{"$f":"IF(OR(ISTEXT(J5),BI5=\"\"),J5,IF(ISTEXT(BI5),BI5,J5+BI5))","v":""},{"$f":"IF(N5=\"\",\"\",N5*60+O5)","v":""},{"$f":"IF(N5=\"\",\"\",IF(BK5<=Basis!$F$11,0,(BK5-Basis!$F$11)*0.4))","v":""},{"$f":"IF(N5=\"\",\"\",IF(BK5>Basis!$G$11,0,(Basis!$G$11-BK5)*0.4))","v":""},{"$f":"IF(M5=\"\",\"\",IF(ISTEXT(M5),M5,IF(ISTEXT(P5),P5,M5+P5)))","v":""}]
[null,null,2,null,null,null,null,null,null,{"$f":"IF(H6=\"\",\"\",IF(ISTEXT(H6),H6,IF(I6=\"\",\"\",IF((H6+I6)/2<=Basis!$M$11,\"Uit\",(100-((H6+I6)/2/Basis!$L$11*100))*Basis!$Y$6))))","v":""},null,null,"","","",{"$f":"IF(N6=\"\",\"\",IF(N6*60+O6>Basis!$U$11,\"Uit\",BL6+BM6))","v":""},null,"",null,null,"","",null,2,null,"-","-","-","-","-","-","-","-","-","-","-","-","-","-","-","-","-","-","-","-","-","-","-","-","",null,null,2,null,"10:02:00",null,"","","",null,{"$f":"IF(K6=\"\",\"\",IF(ISTEXT(K6),K6,IF(K6>Basis!$N$11,\"Uit\",IF(ISBLANK(L6),K6,K6+L6))))","v":""},{"$f":"IF(OR(ISTEXT(J6),BI6=\"\"),J6,IF(ISTEXT(BI6),BI6,J6+BI6))","v":""},{"$f":"IF(N6=\"\",\"\",N6*60+O6)","v":""},{"$f":"IF(N6=\"\",\"\",IF(BK6<=Basis!$F$11,0,(BK6-Basis!$F$11)*0.4))","v":""},{"$f":"IF(N6=\"\",\"\",IF(BK6>Basis!$G$11,0,(Basis!$G$11-BK6)*0.4))","v":""},{"$f":"IF(M6=\"\",\"\",IF(ISTEXT(M6),M6,IF(ISTEXT(P6),P6,M6+P6)))","v":""}]
[null,null,3,null,null,null,null,null,null,{"$f":"IF(H7=\"\",\"\",IF(ISTEXT(H7),H7,IF(I7=\"\",\"\",IF((H7+I7)/2<=Basis!$M$11,\"Uit\",(100-((H7+I7)/2/Basis!$L$11*100))*Basis!$Y$6))))","v":""},null,null,"","","",{"$f":"IF(N7=\"\",\"\",IF(N7*60+O7>Basis!$U$11,\"Uit\",BL7+BM7))","v":""},null,"",null,null,"","",null,3,null,"-","-","-","-","-","-","-","-","-","-","-","-","-","-","-","-","-","-","-","-","-","-","-","-","",null,null,3,null,"10:04:00",null,"","","",null,{"$f":"IF(K7=\"\",\"\",IF(ISTEXT(K7),K7,IF(K7>Basis!$N$11,\"Uit\",IF(ISBLANK(L7),K7,K7+L7))))","v":""},"","",{"$f":"IF(N7=\"\",\"\",IF(BK7<=Basis!$F$11,0,(BK7-Basis!$F$11)*0.4))","v":""},{"$f":"IF(N7=\"\",\"\",IF(BK7>Basis!$G$11,0,(Basis!$G$11-BK7)*0.4))","v":""},""]
[null,null,4,null,null,null,null,null,null,{"$f":"IF(H8=\"\",\"\",IF(ISTEXT(H8),H8,IF(I8=\"\",\"\",IF((H8+I8)/2<=Basis!$M$11,\"Uit\",(100-((H8+I8)/2/Basis!$L$11*100))*Basis!$Y$6))))","v":""},null,null,"","","",{"$f":"IF(N8=\"\",\"\",IF(N8*60+O8>Basis!$U$11,\"Uit\",BL8+BM8))","v":""},null,"",null,null,"","",null,4,null,"-","-","-","-","-","-","-","-","-","-","-","-","-","-","-","-","-","-","-","-","-","-","-","-","",null,null,4,null,null,null,"","","",null,{"$f":"IF(K8=\"\",\"\",IF(ISTEXT(K8),K8,IF(K8>Basis!$N$11,\"Uit\",IF(ISBLANK(L8),K8,K8+L8))))","v":""},"","",{"$f":"IF(N8=\"\",\"\",IF(BK8<=Basis!$F$11,0,(BK8-Basis!$F$11)*0.4))","v":""},{"$f":"IF(N8=\"\",\"\",IF(BK8>Basis!$G$11,0,(Basis!$G$11-BK8)*0.4))","v":""},""]
[null,null,5,null,null,null,null,null,null,{"$f":"IF(H9=\"\",\"\",IF(ISTEXT(H9),H9,IF(I9=\"\",\"\",IF((H9+I9)/2<=Basis!$M$11,\"Uit\",(100-((H9+I9)/2/Basis!$L$11*100))*Basis!$Y$6))))","v":""},null,null,"","","",{"$f":"IF(N9=\"\",\"\",IF(N9*60+O9>Basis!$U$11,\"Uit\",BL9+BM9))","v":""},null,"",null,null,"","",null,5,null,"-","-","-","-","-","-","-","-","-","-","-","-","-","-","-","-","-","-","-","-","-","-","-","-","",null,null,5,null,null,null,"","","",null,{"$f":"IF(K9=\"\",\"\",IF(ISTEXT(K9),K9,IF(K9>Basis!$N$11,\"Uit\",IF(ISBLANK(L9),K9,K9+L9))))","v":""},"","",{"$f":"IF(N9=\"\",\"\",IF(BK9<=Basis!$F$11,0,(BK9-Basis!$F$11)*0.4))","v":""},{"$f":"IF(N9=\"\",\"\",IF(BK9>Basis!$G$11,0,(Basis!$G$11-BK9)*0.4))","v":""},""]
[null,null,6,null,null,null,null,null,null,{"$f":"IF(H10=\"\",\"\",IF(ISTEXT(H10),H10,IF(I10=\"\",\"\",IF((H10+I10)/2<=Basis!$M$11,\"Uit\",(100-((H10+I10)/2/Basis!$L$11*100))*Basis!$Y$6))))","v":""},null,null,"","","",{"$f":"IF(N10=\"\",\"\",IF(N10*60+O10>Basis!$U$11,\"Uit\",BL10+BM10))","v":""},null,"",null,null,"","",null,6,null,"-","-","-","-","-","-","-","-","-","-","-","-","-","-","-","-","-","-","-","-","-","-","-","-","",null,null,6,null,null,null,"","","",null,{"$f":"IF(K10=\"\",\"\",IF(ISTEXT(K10),K10,IF(K10>Basis!$N$11,\"Uit\",IF(ISBLANK(L10),K10,K10+L10))))","v":""},"","",{"$f":"IF(N10=\"\",\"\",IF(BK10<=Basis!$F$11,0,(BK10-Basis!$F$11)*0.4))","v":""},{"$f":"IF(N10=\"\",\"\",IF(BK10>Basis!$G$11,0,(Basis!$G$11-BK10)*0.4))","v":""},""]
[null,null,7,null,null,null,null,null,null,{"$f":"IF(H11=\"\",\"\",IF(ISTEXT(H11),H11,IF(I11=\"\",\"\",IF((H11+I11)/2<=Basis!$M$11,\"Uit\",(100-((H11+I11)/2/Basis!$L$11*100))*Basis!$Y$6))))","v":""},null,null,"","","",{"$f":"IF(N11=\"\",\"\",IF(N11*60+O11>Basis!$U$11,\"Uit\",BL11+BM11))","v":""},null,"",null,null,"","",null,7,null,"-","-","-","-","-","-","-","-","-","-","-","-","-","-","-","-","-","-","-","-","-","-","-","-","",null,null,7,null,null,null,"","","",null,{"$f":"IF(K11=\"\",\"\",IF(ISTEXT(K11),K11,IF(K11>Basis!$N$11,\"Uit\",IF(ISBLANK(L11),K11,K11+L11))))","v":""},"","",{"$f":"IF(N11=\"\",\"\",IF(BK11<=Basis!$F$11,0,(BK11-Basis!$F$11)*0.4))","v":""},{"$f":"IF(N11=\"\",\"\",IF(BK11>Basis!$G$11,0,(Basis!$G$11-BK11)*0.4))","v":""},""]
[null,null,8,null,null,null,null,null,null,{"$f":"IF(H12=\"\",\"\",IF(ISTEXT(H12),H12,IF(I12=\"\",\"\",IF((H12+I12)/2<=Basis!$M$11,\"Uit\",(100-((H12+I12)/2/Basis!$L$11*100))*Basis!$Y$6))))","v":""},null,null,"","","",{"$f":"IF(N12=\"\",\"\",IF(N12*60+O12>Basis!$U$11,\"Uit\",BL12+BM12))","v":""},null,"",null,null,"","",null,8,null,"-","-","-","-","-","-","-","-","-","-","-","-","-","-","-","-","-","-","-","-","-","-","-","-","",null,null,8,null,null,null,"","","",null,{"$f":"IF(K12=\"\",\"\",IF(ISTEXT(K12),K12,IF(K12>Basis!$N$11,\"Uit\",IF(ISBLANK(L12),K12,K12+L12))))","v":""},"","",{"$f":"IF(N12=\"\",\"\",IF(BK12<=Basis!$F$11,0,(BK12-Basis!$F$11)*0.4))","v":""},{"$f":"IF(N12=\"\",\"\",IF(BK12>Basis!$G$11,0,(Basis!$G$11-BK12)*0.4))","v":""},""]
[null,null,9,null,null,null,null,null,null,{"$f":"IF(H13=\"\",\"\",IF(ISTEXT(H13),H13,IF(I13=\"\",\"\",IF((H13+I13)/2<=Basis!$M$11,\"Uit\",(100-((H13+I13)/2/Basis!$L$11*100))*Basis!$Y$6))))","v":""},null,null,"","","",{"$f":"IF(N13=\"\",\"\",IF(N13*60+O13>Basis!$U$11,\"Uit\",BL13+BM13))","v":""},null,"",null,null,"","",null,9,null,"-","-","-","-","-","-","-","-","-","-","-","-","-","-","-","-","-","-","-","-","-","-","-","-","",null,null,9,null,null,null,"","","",null,{"$f":"IF(K13=\"\",\"\",IF(ISTEXT(K13),K13,IF(K13>Basis!$N$11,\"Uit\",IF(ISBLANK(L13),K13,K13+L13))))","v":""},"","",{"$f":"IF(N13=\"\",\"\",IF(BK13<=Basis!$F$11,0,(BK13-Basis!$F$11)*0.4))","v":""},{"$f":"IF(N13=\"\",\"\",IF(BK13>Basis!$G$11,0,(Basis!$G$11-BK13)*0.4))","v":""},""]
[null,null,10,null,null,null,null,null,null,{"$f":"IF(H14=\"\",\"\",IF(ISTEXT(H14),H14,IF(I14=\"\",\"\",IF((H14+I14)/2<=Basis!$M$11,\"Uit\",(100-((H14+I14)/2/Basis!$L$11*100))*Basis!$Y$6))))","v":""},null,null,"","","",{"$f":"IF(N14=\"\",\"\",IF(N14*60+O14>Basis!$U$11,\"Uit\",BL14+BM14))","v":""},null,"",null,null,"","",null,10,null,"-","-","-","-","-","-","-","-","-","-","-","-","-","-","-","-","-","-","-","-","-","-","-","-","",null,null,10,null,null,null,"","","",null,{"$f":"IF(K14=\"\",\"\",IF(ISTEXT(K14),K14,IF(K14>Basis!$N$11,\"Uit\",IF(ISBLANK(L14),K14,K14+L14))))","v":""},"","",{"$f":"IF(N14=\"\",\"\",IF(BK14<=Basis!$F$11,0,(BK14-Basis!$F$11)*0.4))","v":""},{"$f":"IF(N14=\"\",\"\",IF(BK14>Basis!$G$11,0,(Basis!$G$11-BK14)*0.4))","v":""},""]
[null,null,null,null,null,null,null,null,null,{"$f":"IF(H15=\"\",\"\",IF(ISTEXT(H15),H15,IF(I15=\"\",\"\",IF((H15+I15)/2<=Basis!$M$11,\"Uit\",(100-((H15+I15)/2/Basis!$L$11*100))*Basis!$Y$6))))","v":""},null,null,"","","",{"$f":"IF(N15=\"\",\"\",IF(N15*60+O15>Basis!$U$11,\"Uit\",BL15+BM15))","v":""},null,"",null,null,"","",null,"",null,"-","-","-","-","-","-","-","-","-","-","-","-","-","-","-","-","-","-","-","-","-","-","-","-","",null,null,"",null,null,null,"","","",null,{"$f":"IF(K15=\"\",\"\",IF(ISTEXT(K15),K15,IF(K15>Basis!$N$11,\"Uit\",IF(ISBLANK(L15),K15,K15+L15))))","v":""},"","",{"$f":"IF(N15=\"\",\"\",IF(BK15<=Basis!$F$11,0,(BK15-Basis!$F$11)*0.4))","v":""},{"$f":"IF(N15=\"\",\"\",IF(BK15>Basis!$G$11,0,(Basis!$G$11-BK15)*0.4))","v":""},""]
[null,null,null,null,null,null,null,null,null,{"$f":"IF(H16=\"\",\"\",IF(ISTEXT(H16),H16,IF(I16=\"\",\"\",IF((H16+I16)/2<=Basis!$M$11,\"Uit\",(100-((H16+I16)/2/Basis!$L$11*100))*Basis!$Y$6))))","v":""},null,null,"","","",{"$f":"IF(N16=\"\",\"\",IF(N16*60+O16>Basis!$U$11,\"Uit\",BL16+BM16))","v":""},null,"",null,null,"","",null,"",null,"-","-","-","-","-","-","-","-","-","-","-","-","-","-","-","-","-","-","-","-","-","-","-","-","",null,null,"",null,null,null,"","","",null,{"$f":"IF(K16=\"\",\"\",IF(ISTEXT(K16),K16,IF(K16>Basis!$N$11,\"Uit\",IF(ISBLANK(L16),K16,K16+L16))))","v":""},"","",{"$f":"IF(N16=\"\",\"\",IF(BK16<=Basis!$F$11,0,(BK16-Basis!$F$11)*0.4))","v":""},{"$f":"IF(N16=\"\",\"\",IF(BK16>Basis!$G$11,0,(Basis!$G$11-BK16)*0.4))","v":""},""]
[null,null,null,null,null,null,null,null,null,{"$f":"IF(H17=\"\",\"\",IF(ISTEXT(H17),H17,IF(I17=\"\",\"\",IF((H17+I17)/2<=Basis!$M$11,\"Uit\",(100-((H17+I17)/2/Basis!$L$11*100))*Basis!$Y$6))))","v":""},null,null,"","","",{"$f":"IF(N17=\"\",\"\",IF(N17*60+O17>Basis!$U$11,\"Uit\",BL17+BM17))","v":""},null,"",null,null,"","",null,"",null,"-","-","-","-","-","-","-","-","-","-","-","-","-","-","-","-","-","-","-","-","-","-","-","-","",null,null,"",null,null,null,"","","",null,{"$f":"IF(K17=\"\",\"\",IF(ISTEXT(K17),K17,IF(K17>Basis!$N$11,\"Uit\",IF(ISBLANK(L17),K17,K17+L17))))","v":""},"","",{"$f":"IF(N17=\"\",\"\",IF(BK17<=Basis!$F$11,0,(BK17-Basis!$F$11)*0.4))","v":""},{"$f":"IF(N17=\"\",\"\",IF(BK17>Basis!$G$11,0,(Basis!$G$11-BK17)*0.4))","v":""},""]
[null,null,null,null,null,null,null,null,null,{"$f":"IF(H18=\"\",\"\",IF(ISTEXT(H18),H18,IF(I18=\"\",\"\",IF((H18+I18)/2<=Basis!$M$11,\"Uit\",(100-((H18+I18)/2/Basis!$L$11*100))*Basis!$Y$6))))","v":""},null,null,"","","",{"$f":"IF(N18=\"\",\"\",IF(N18*60+O18>Basis!$U$11,\"Uit\",BL18+BM18))","v":""},null,"",null,null,"","",null,"",null,"-","-","-","-","-","-","-","-","-","-","-","-","-","-","-","-","-","-","-","-","-","-","-","-","",null,null,"",null,null,null,"","","",null,{"$f":"IF(K18=\"\",\"\",IF(ISTEXT(K18),K18,IF(K18>Basis!$N$11,\"Uit\",IF(ISBLANK(L18),K18,K18+L18))))","v":""},"","",{"$f":"IF(N18=\"\",\"\",IF(BK18<=Basis!$F$11,0,(BK18-Basis!$F$11)*0.4))","v":""},{"$f":"IF(N18=\"\",\"\",IF(BK18>Basis!$G$11,0,(Basis!$G$11-BK18)*0.4))","v":""},""]
[null,null,null,null,null,null,null,null,null,{"$f":"IF(H19=\"\",\"\",IF(ISTEXT(H19),H19,IF(I19=\"\",\"\",IF((H19+I19)/2<=Basis!$M$11,\"Uit\",(100-((H19+I19)/2/Basis!$L$11*100))*Basis!$Y$6))))","v":""},null,null,"","","",{"$f":"IF(N19=\"\",\"\",IF(N19*60+O19>Basis!$U$11,\"Uit\",BL19+BM19))","v":""},null,"",null,null,"","",null,"",null,"-","-","-","-","-","-","-","-","-","-","-","-","-","-","-","-","-","-","-","-","-","-","-","-","",null,null,"",null,null,null,"","","",null,{"$f":"IF(K19=\"\",\"\",IF(ISTEXT(K19),K19,IF(K19>Basis!$N$11,\"Uit\",IF(ISBLANK(L19),K19,K19+L19))))","v":""},"","",{"$f":"IF(N19=\"\",\"\",IF(BK19<=Basis!$F$11,0,(BK19-Basis!$F$11)*0.4))","v":""},{"$f":"IF(N19=\"\",\"\",IF(BK19>Basis!$G$11,0,(Basis!$G$11-BK19)*0.4))","v":""},""]
[null,null,null,null,null,null,null,null,null,{"$f":"IF(H20=\"\",\"\",IF(ISTEXT(H20),H20,IF(I20=\"\",\"\",IF((H20+I20)/2<=Basis!$M$11,\"Uit\",(100-((H20+I20)/2/Basis!$L$11*100))*Basis!$Y$6))))","v":""},null,null,"","","",{"$f":"IF(N20=\"\",\"\",IF(N20*60+O20>Basis!$U$11,\"Uit\",BL20+BM20))","v":""},null,"",null,null,"","",null,"",null,"-","-","-","-","-","-","-","-","-","-","-","-","-","-","-","-","-","-","-","-","-","-","-","-","",null,null,"",null,null,null,"","","",null,{"$f":"IF(K20=\"\",\"\",IF(ISTEXT(K20),K20,IF(K20>Basis!$N$11,\"Uit\",IF(ISBLANK(L20),K20,K20+L20))))","v":""},"","",{"$f":"IF(N20=\"\",\"\",IF(BK20<=Basis!$F$11,0,(BK20-Basis!$F$11)*0.4))","v":""},{"$f":"IF(N20=\"\",\"\",IF(BK20>Basis!$G$11,0,(Basis!$G$11-BK20)*0.4))","v":""},""]
[null,null,null,null,null,null,null,null,null,{"$f":"IF(H21=\"\",\"\",IF(ISTEXT(H21),H21,IF(I21=\"\",\"\",IF((H21+I21)/2<=Basis!$M$11,\"Uit\",(100-((H21+I21)/2/Basis!$L$11*100))*Basis!$Y$6))))","v":""},null,null,"","","",{"$f":"IF(N21=\"\",\"\",IF(N21*60+O21>Basis!$U$11,\"Uit\",BL21+BM21))","v":""},null,"",null,null,"","",null,"",null,"-","-","-","-","-","-","-","-","-","-","-","-","-","-","-","-","-","-","-","-","-","-","-","-","",null,null,"",null,null,null,"","","",null,{"$f":"IF(K21=\"\",\"\",IF(ISTEXT(K21),K21,IF(K21>Basis!$N$11,\"Uit\",IF(ISBLANK(L21),K21,K21+L21))))","v":""},"","",{"$f":"IF(N21=\"\",\"\",IF(BK21<=Basis!$F$11,0,(BK21-Basis!$F$11)*0.4))","v":""},{"$f":"IF(N21=\"\",\"\",IF(BK21>Basis!$G$11,0,(Basis!$G$11-BK21)*0.4))","v":""},""]
[null,null,null,null,null,null,null,null,null,{"$f":"IF(H22=\"\",\"\",IF(ISTEXT(H22),H22,IF(I22=\"\",\"\",IF((H22+I22)/2<=Basis!$M$11,\"Uit\",(100-((H22+I22)/2/Basis!$L$11*100))*Basis!$Y$6))))","v":""},null,null,"","","",{"$f":"IF(N22=\"\",\"\",IF(N22*60+O22>Basis!$U$11,\"Uit\",BL22+BM22))","v":""},null,"",null,null,"","",null,"",null,"-","-","-","-","-","-","-","-","-","-","-","-","-","-","-","-","-","-","-","-","-","-","-","-","",null,null,"",null,null,null,"","","",null,{"$f":"IF(K22=\"\",\"\",IF(ISTEXT(K22),K22,IF(K22>Basis!$N$11,\"Uit\",IF(ISBLANK(L22),K22,K22+L22))))","v":""},"","",{"$f":"IF(N22=\"\",\"\",IF(BK22<=Basis!$F$11,0,(BK22-Basis!$F$11)*0.4))","v":""},{"$f":"IF(N22=\"\",\"\",IF(BK22>Basis!$G$11,0,(Basis!$G$11-BK22)*0.4))","v":""},""]
[null,null,null,null,null,null,null,null,null,{"$f":"IF(H23=\"\",\"\",IF(ISTEXT(H23),H23,IF(I23=\"\",\"\",IF((H23+I23)/2<=Basis!$M$11,\"Uit\",(100-((H23+I23)/2/Basis!$L$11*100))*Basis!$Y$6))))","v":""},null,null,"","","",{"$f":"IF(N23=\"\",\"\",IF(N23*60+O23>Basis!$U$11,\"Uit\",BL23+BM23))","v":""},null,"",null,null,"","",null,"",null,"-","-","-","-","-","-","-","-","-","-","-","-","-","-","-","-","-","-","-","-","-","-","-","-","",null,null,"",null,null,null,"","","",null,{"$f":"IF(K23=\"\",\"\",IF(ISTEXT(K23),K23,IF(K23>Basis!$N$11,\"Uit\",IF(ISBLANK(L23),K23,K23+L23))))","v":""},"","",{"$f":"IF(N23=\"\",\"\",IF(BK23<=Basis!$F$11,0,(BK23-Basis!$F$11)*0.4))","v":""},{"$f":"IF(N23=\"\",\"\",IF(BK23>Basis!$G$11,0,(Basis!$G$11-BK23)*0.4))","v":""},""]
[null,null,null,null,null,null,null,null,null,{"$f":"IF(H24=\"\",\"\",IF(ISTEXT(H24),H24,IF(I24=\"\",\"\",IF((H24+I24)/2<=Basis!$M$11,\"Uit\",(100-((H24+I24)/2/Basis!$L$11*100))*Basis!$Y$6))))","v":""},null,null,"","","",{"$f":"IF(N24=\"\",\"\",IF(N24*60+O24>Basis!$U$11,\"Uit\",BL24+BM24))","v":""},null,"",null,null,"","",null,"",null,"-","-","-","-","-","-","-","-","-","-","-","-","-","-","-","-","-","-","-","-","-","-","-","-","",null,null,"",null,null,null,"","","",null,{"$f":"IF(K24=\"\",\"\",IF(ISTEXT(K24),K24,IF(K24>Basis!$N$11,\"Uit\",IF(ISBLANK(L24),K24,K24+L24))))","v":""},"","",{"$f":"IF(N24=\"\",\"\",IF(BK24<=Basis!$F$11,0,(BK24-Basis!$F$11)*0.4))","v":""},{"$f":"IF(N24=\"\",\"\",IF(BK24>Basis!$G$11,0,(Basis!$G$11-BK24)*0.4))","v":""},""]
[null,null,null,null,null,null,null,null,null,{"$f":"IF(H25=\"\",\"\",IF(ISTEXT(H25),H25,IF(I25=\"\",\"\",IF((H25+I25)/2<=Basis!$M$11,\"Uit\",(100-((H25+I25)/2/Basis!$L$11*100))*Basis!$Y$6))))","v":""},null,null,"","","",{"$f":"IF(N25=\"\",\"\",IF(N25*60+O25>Basis!$U$11,\"Uit\",BL25+BM25))","v":""},null,"",null,null,"","",null,"",null,"-","-","-","-","-","-","-","-","-","-","-","-","-","-","-","-","-","-","-","-","-","-","-","-","",null,null,"",null,null,null,"","","",null,{"$f":"IF(K25=\"\",\"\",IF(ISTEXT(K25),K25,IF(K25>Basis!$N$11,\"Uit\",IF(ISBLANK(L25),K25,K25+L25))))","v":""},"","",{"$f":"IF(N25=\"\",\"\",IF(BK25<=Basis!$F$11,0,(BK25-Basis!$F$11)*0.4))","v":""},{"$f":"IF(N25=\"\",\"\",IF(BK25>Basis!$G$11,0,(Basis!$G$11-BK25)*0.4))","v":""},""]
[null,null,null,null,null,null,null,null,null,{"$f":"IF(H26=\"\",\"\",IF(ISTEXT(H26),H26,IF(I26=\"\",\"\",IF((H26+I26)/2<=Basis!$M$11,\"Uit\",(100-((H26+I26)/2/Basis!$L$11*100))*Basis!$Y$6))))","v":""},null,null,"","","",{"$f":"IF(N26=\"\",\"\",IF(N26*60+O26>Basis!$U$11,\"Uit\",BL26+BM26))","v":""},null,"",null,null,"","",null,"",null,"-","-","-","-","-","-","-","-","-","-","-","-","-","-","-","-","-","-","-","-","-","-","-","-","",null,null,"",null,null,null,"","","",null,{"$f":"IF(K26=\"\",\"\",IF(ISTEXT(K26),K26,IF(K26>Basis!$N$11,\"Uit\",IF(ISBLANK(L26),K26,K26+L26))))","v":""},"","",{"$f":"IF(N26=\"\",\"\",IF(BK26<=Basis!$F$11,0,(BK26-Basis!$F$11)*0.4))","v":""},{"$f":"IF(N26=\"\",\"\",IF(BK26>Basis!$G$11,0,(Basis!$G$11-BK26)*0.4))","v":""},""]
[null,null,null,null,null,null,null,null,null,{"$f":"IF(H27=\"\",\"\",IF(ISTEXT(H27),H27,IF(I27=\"\",\"\",IF((H27+I27)/2<=Basis!$M$11,\"Uit\",(100-((H27+I27)/2/Basis!$L$11*100))*Basis!$Y$6))))","v":""},null,null,"","","",{"$f":"IF(N27=\"\",\"\",IF(N27*60+O27>Basis!$U$11,\"Uit\",BL27+BM27))","v":""},null,"",null,null,"","",null,"",null,"-","-","-","-","-","-","-","-","-","-","-","-","-","-","-","-","-","-","-","-","-","-","-","-","",null,null,"",null,null,null,"","","",null,{"$f":"IF(K27=\"\",\"\",IF(ISTEXT(K27),K27,IF(K27>Basis!$N$11,\"Uit\",IF(ISBLANK(L27),K27,K27+L27))))","v":""},"","",{"$f":"IF(N27=\"\",\"\",IF(BK27<=Basis!$F$11,0,(BK27-Basis!$F$11)*0.4))","v":""},{"$f":"IF(N27=\"\",\"\",IF(BK27>Basis!$G$11,0,(Basis!$G$11-BK27)*0.4))","v":""},""]
[null,null,null,null,null,null,null,null,null,{"$f":"IF(H28=\"\",\"\",IF(ISTEXT(H28),H28,IF(I28=\"\",\"\",IF((H28+I28)/2<=Basis!$M$11,\"Uit\",(100-((H28+I28)/2/Basis!$L$11*100))*Basis!$Y$6))))","v":""},null,null,"","","",{"$f":"IF(N28=\"\",\"\",IF(N28*60+O28>Basis!$U$11,\"Uit\",BL28+BM28))","v":""},null,"",null,null,"","",null,"",null,"-","-","-","-","-","-","-","-","-","-","-","-","-","-","-","-","-","-","-","-","-","-","-","-","",null,null,"",null,null,null,"","","",null,{"$f":"IF(K28=\"\",\"\",IF(ISTEXT(K28),K28,IF(K28>Basis!$N$11,\"Uit\",IF(ISBLANK(L28),K28,K28+L28))))","v":""},"","",{"$f":"IF(N28=\"\",\"\",IF(BK28<=Basis!$F$11,0,(BK28-Basis!$F$11)*0.4))","v":""},{"$f":"IF(N28=\"\",\"\",IF(BK28>Basis!$G$11,0,(Basis!$G$11-BK28)*0.4))","v":""},""]
[null,null,null,null,null,null,null,null,null,{"$f":"IF(H29=\"\",\"\",IF(ISTEXT(H29),H29,IF(I29=\"\",\"\",IF((H29+I29)/2<=Basis!$M$11,\"Uit\",(100-((H29+I29)/2/Basis!$L$11*100))*Basis!$Y$6))))","v":""},null,null,"","","",{"$f":"IF(N29=\"\",\"\",IF(N29*60+O29>Basis!$U$11,\"Uit\",BL29+BM29))","v":""},null,"",null,null,"","",null,"",null,"-","-","-","-","-","-","-","-","-","-","-","-","-","-","-","-","-","-","-","-","-","-","-","-","",null,null,"",null,null,null,"","","",null,{"$f":"IF(K29=\"\",\"\",IF(ISTEXT(K29),K29,IF(K29>Basis!$N$11,\"Uit\",IF(ISBLANK(L29),K29,K29+L29))))","v":""},"","",{"$f":"IF(N29=\"\",\"\",IF(BK29<=Basis!$F$11,0,(BK29-Basis!$F$11)*0.4))","v":""},{"$f":"IF(N29=\"\",\"\",IF(BK29>Basis!$G$11,0,(Basis!$G$11-BK29)*0.4))","v":""},""]
["  Bij uitsluiting reden vermelden : ",null,null,null,null,null,null,null,null,null,null,null,null,null,null,{"$f":"NOW()","v":"2018-06-30T22:02:24.880"},null,null,null,null,null,null,null,{"$f":"A30","v":"  Bij uitsluiting reden vermelden : "},null,null,null,null,null,null,null,null,null,null,null,null,null,null,null,null,null,null,null,null,null,null,{"$f":"NOW()","v":"2018-06-30T22:02:24.880"}]
["  VP=val paard, VR=val ruiter, 3W=3 weigeringen op zelfde hindernis, 4W=4 weigeringen totaal, FP=foutief parcours, Vr.v= vrijwillig verlaten",null,null,null,null,null,null,null,null,null,null,null,null,null,null,null,null,null,null,null,null,null,null,{"$f":"A31","v":"  VP=val paard, VR=val ruiter, 3W=3 weigeringen op zelfde hindernis, 4W=4 weigeringen totaal, FP=foutief parcours, Vr.v= vrijwillig verlaten"}]

{"sheet":"Pony's B-ABC","index":12,"n_rows":31,"n_cols":71,"rows_kept":31,"cut":false,"hidden":true,"merged":[[2,13,2,14],[29,15,29,21],[29,46,29,52]]}
[{"$f":"\" Samengestelde wedstrijd \"&Basis!D18","v":" Samengestelde wedstrijd Eventing Leende 30 juni 2018"},null,null,null,null,null,"Klasse B - Cat ABC - Ring 1",null,null,null,null,"Dressuurjury : ",null,null,null,null,null,null,null,null,null,null,null," Verzamelstaat hindernisfouten in de cross",null,null,null,null,null,null,null,null,null,null,null,null,{"$f":"A1","v":" Samengestelde wedstrijd Eventing Leende 30 juni 2018"},null,null,null,null,null,null,null,null,null,null,null,null,null,null,null,{"$f":"G1&\" \"","v":"Klasse B - Cat ABC - Ring 1 "},null," Indien aankomstUUR cross wordt meegedeeld :",null,null,null,null,null," Hulpkolommen",null,null,null,null,null,null," Stijlcijfers :"]
["rank","pony","rugnr","combinatie nr","naam ruiter","naam pony","vereniging / plaats",null,"dressuur","dressuur","hind.ft.","tijd.ft.","hind.ft.","min","sec","tijd.ft.",null,"totaal","(1) stijl","(2) stijl","eind-","reden",null,null,"hindernisnummer",null,null,null,null,null,null,null,null,null,null,null,null,null,null,null,null,null,null,null,null,null,null,null,null,null," ",null,null,null,null,null,null,null,null,null,"Uitslag","NA","tijd (sec)","tijd.ft.","reg.ft.","totaal",null,"Totaal","Totaal","Gemiddelde","Gemiddelde"]
["HC","cat.",null,null,null,null,null,null,"totaal","strafpntn.","springen","springen","cross","cross",null,{"$f":"Basis!$H$20&\":\"&TEXT(Basis!$I$20,\"00\")","v":"3:58"},null,null,"cijfer","cijfer","totaal","uitsluiting",null,"nr",1,2,3,4,5,6,7,8,9,10,11,12,13,14,15,16,17,18,19,20,21,22,23,24,25,"totaal","reden uitsluiting","hind.","nr",null,"Vertrekuur","Aankomst","Tijd","Minuten","Seconden",null,"Springen","Springen","cross","opt.tijd =",{"$f":"Basis!$H$20&\":\"&TEXT(Basis!$I$20,\"00\")","v":"3:58"},"cross",null,"Jury 1","Jury 2","Jury 1","Jury 2"]
[null,null,null,null,null,null,null,null,null,null,null,null,null,null,null,null,null,{"$f":"IF(ISBLANK(I4),\"\",IF(AND(ISBLANK(K4),ISBLANK(Y4)),J4,IF(ISTEXT(K4),K4,IF(OR(ISBLANK(M4),M4=\"\"),J4+K4+L4,IF(ISTEXT(M4),M4,IF(ISBLANK(Y4),J4+K4+L4,J4+K4+L4+M4+P4+Q4))))))","v":""}]
[null,null,1,null,null,null,null,null,null,{"$f":"IF(I5=\"\",\"\",IF(ISTEXT(I5),I5,IF(I5<=Basis!$M$20,\"Uit\",(100-(I5/Basis!$L$20*100))*Basis!$Y$19)))","v":""},null,null,{"$f":"IF(AX5=\"\",\"\",AX5)","v":""},{"$f":"IF(ISBLANK(BD5),\"\",BF5)","v":""},{"$f":"IF(ISBLANK(BD5),\"\",BG5)","v":""},{"$f":"IF(N5=\"\",\"\",IF(N5*60+O5>Basis!$U$20,\"Uit\",BL5+BM5))","v":""},null,{"$f":"IF(ISTEXT(BJ5),BJ5,IF(OR(ISBLANK(M5),M5=\"\",ISBLANK(Y5)),BJ5,IF(ISTEXT(BN5),BN5,BJ5+BN5)))","v":""},{"$f":"IF(BP5=\"\",\"\",BR5)","v":""},{"$f":"IF(BQ5=\"\",\"\",BS5)","v":""},{"$f":"IF(R5=\"\",\"\",IF(ISTEXT(R5),R5,IF(BP5=\"\",\"\",R5-S5-T5)))","v":""},{"$f":"IF(AY5=\"\",\"\",AY5)","v":""},null,{"$f":"IF($C5=\"\",\"\",$C5)","v":1},null,"-","-","-","-","-","-","-","-","-","-","-","-","-","-","-","-","-","-","-","-","-","-","-","-",{"$f":"IF(Y5=\"\",\"\",IF(ISTEXT(Y5),Y5,SUM(Y5:AW5)))","v":""},null,null,{"$f":"IF($C5=\"\",\"\",$C5)","v":1},null,"10:00:00",null,{"$f":"IF(ISBLANK(BD5),\"\",BD5-BC5)","v":""},{"$f":"IF(ISBLANK(BD5),\"\",MINUTE(BE5))","v":""},{"$f":"IF(ISBLANK(BD5),\"\",SECOND(BE5))","v":""},null,{"$f":"IF(K5=\"\",\"\",IF(ISTEXT(K5),K5,IF(K5>Basis!$N$20,\"Uit\",IF(ISBLANK(L5),K5,K5+L5))))","v":""},{"$f":"IF(OR(ISTEXT(J5),BI5=\"\"),J5,IF(ISTEXT(BI5),BI5,J5+BI5))","v":""},{"$f":"IF(N5=\"\",\"\",N5*60+O5)","v":""},{"$f":"IF(N5=\"\",\"\",IF(BK5<=Basis!$F$20,0,(BK5-Basis!$F$20)*0.4))","v":""},{"$f":"IF(N5=\"\",\"\",IF(BK5>Basis!$G$20,0,(Basis!$G$20-BK5)*0.4))","v":""},{"$f":"IF(M5=\"\",\"\",IF(ISTEXT(M5),M5,IF(ISTEXT(P5),P5,M5+P5)))","v":""},null,null,null,{"$f":"IF(BP5=\"\",\"\",BP5/3)","v":""},{"$f":"IF(BQ5=\"\",\"\",BQ5/3)","v":""}]
[null,null,2,null,null,null,null,null,null,{"$f":"IF(I6=\"\",\"\",IF(ISTEXT(I6),I6,IF(I6<=Basis!$M$20,\"Uit\",(100-(I6/Basis!$L$20*100))*Basis!$Y$19)))","v":""},null,null,"","","",{"$f":"IF(N6=\"\",\"\",IF(N6*60+O6>Basis!$U$20,\"Uit\",BL6+BM6))","v":""},null,"",{"$f":"IF(BP6=\"\",\"\",BR6)","v":""},"",{"$f":"IF(R6=\"\",\"\",IF(ISTEXT(R6),R6,IF(BP6=\"\",\"\",R6-S6-T6)))","v":""},"",null,2,null,"-","-","-","-","-","-","-","-","-","-","-","-","-","-","-","-","-","-","-","-","-","-","-","-","",null,null,2,null,"10:02:00",null,"","","",null,{"$f":"IF(K6=\"\",\"\",IF(ISTEXT(K6),K6,IF(K6>Basis!$N$20,\"Uit\",IF(ISBLANK(L6),K6,K6+L6))))","v":""},{"$f":"IF(OR(ISTEXT(J6),BI6=\"\"),J6,IF(ISTEXT(BI6),BI6,J6+BI6))","v":""},{"$f":"IF(N6=\"\",\"\",N6*60+O6)","v":""},{"$f":"IF(N6=\"\",\"\",IF(BK6<=Basis!$F$20,0,(BK6-Basis!$F$20)*0.4))","v":""},{"$f":"IF(N6=\"\",\"\",IF(BK6>Basis!$G$20,0,(Basis!$G$20-BK6)*0.4))","v":""},{"$f":"IF(M6=\"\",\"\",IF(ISTEXT(M6),M6,IF(ISTEXT(P6),P6,M6+P6)))","v":""},null,null,null,{"$f":"IF(BP6=\"\",\"\",BP6/3)","v":""},""]
[null,null,3,null,null,null,null,null,null,{"$f":"IF(I7=\"\",\"\",IF(ISTEXT(I7),I7,IF(I7<=Basis!$M$20,\"Uit\",(100-(I7/Basis!$L$20*100))*Basis!$Y$19)))","v":""},null,null,"","","",{"$f":"IF(N7=\"\",\"\",IF(N7*60+O7>Basis!$U$20,\"Uit\",BL7+BM7))","v":""},null,"","","","","",null,3,null,"-","-","-","-","-","-","-","-","-","-","-","-","-","-","-","-","-","-","-","-","-","-","-","-","",null,null,3,null,"10:04:00",null,"","","",null,{"$f":"IF(K7=\"\",\"\",IF(ISTEXT(K7),K7,IF(K7>Basis!$N$20,\"Uit\",IF(ISBLANK(L7),K7,K7+L7))))","v":""},"","",{"$f":"IF(N7=\"\",\"\",IF(BK7<=Basis!$F$20,0,(BK7-Basis!$F$20)*0.4))","v":""},{"$f":"IF(N7=\"\",\"\",IF(BK7>Basis!$G$20,0,(Basis!$G$20-BK7)*0.4))","v":""},"",null,null,null,"",""]
[null,null,4,null,null,null,null,null,null,{"$f":"IF(I8=\"\",\"\",IF(ISTEXT(I8),I8,IF(I8<=Basis!$M$20,\"Uit\",(100-(I8/Basis!$L$20*100))*Basis!$Y$19)))","v":""},null,null,"","","",{"$f":"IF(N8=\"\",\"\",IF(N8*60+O8>Basis!$U$20,\"Uit\",BL8+BM8))","v":""},null,"","","","","",null,4,null,"-","-","-","-","-","-","-","-","-","-","-","-","-","-","-","-","-","-","-","-","-","-","-","-","",null,null,4,null,null,null,"","","",null,{"$f":"IF(K8=\"\",\"\",IF(ISTEXT(K8),K8,IF(K8>Basis!$N$20,\"Uit\",IF(ISBLANK(L8),K8,K8+L8))))","v":""},"","",{"$f":"IF(N8=\"\",\"\",IF(BK8<=Basis!$F$20,0,(BK8-Basis!$F$20)*0.4))","v":""},{"$f":"IF(N8=\"\",\"\",IF(BK8>Basis!$G$20,0,(Basis!$G$20-BK8)*0.4))","v":""},"",null,null,null,"",""]
[null,null,5,null,null,null,null,null,null,{"$f":"IF(I9=\"\",\"\",IF(ISTEXT(I9),I9,IF(I9<=Basis!$M$20,\"Uit\",(100-(I9/Basis!$L$20*100))*Basis!$Y$19)))","v":""},null,null,"","","",{"$f":"IF(N9=\"\",\"\",IF(N9*60+O9>Basis!$U$20,\"Uit\",BL9+BM9))","v":""},null,"","","","","",null,5,null,"-","-","-","-","-","-","-","-","-","-","-","-","-","-","-","-","-","-","-","-","-","-","-","-","",null,null,5,null,null,null,"","","",null,{"$f":"IF(K9=\"\",\"\",IF(ISTEXT(K9),K9,IF(K9>Basis!$N$20,\"Uit\",IF(ISBLANK(L9),K9,K9+L9))))","v":""},"","",{"$f":"IF(N9=\"\",\"\",IF(BK9<=Basis!$F$20,0,(BK9-Basis!$F$20)*0.4))","v":""},{"$f":"IF(N9=\"\",\"\",IF(BK9>Basis!$G$20,0,(Basis!$G$20-BK9)*0.4))","v":""},"",null,null,null,"",""]
[null,null,6,null,null,null,null,null,null,{"$f":"IF(I10=\"\",\"\",IF(ISTEXT(I10),I10,IF(I10<=Basis!$M$20,\"Uit\",(100-(I10/Basis!$L$20*100))*Basis!$Y$19)))","v":""},null,null,"","","",{"$f":"IF(N10=\"\",\"\",IF(N10*60+O10>Basis!$U$20,\"Uit\",BL10+BM10))","v":""},null,"","","","","",null,6,null,"-","-","-","-","-","-","-","-","-","-","-","-","-","-","-","-","-","-","-","-","-","-","-","-","",null,null,6,null,null,null,"","","",null,{"$f":"IF(K10=\"\",\"\",IF(ISTEXT(K10),K10,IF(K10>Basis!$N$20,\"Uit\",IF(ISBLANK(L10),K10,K10+L10))))","v":""},"","",{"$f":"IF(N10=\"\",\"\",IF(BK10<=Basis!$F$20,0,(BK10-Basis!$F$20)*0.4))","v":""},{"$f":"IF(N10=\"\",\"\",IF(BK10>Basis!$G$20,0,(Basis!$G$20-BK10)*0.4))","v":""},"",null,null,null,"",""]
[null,null,7,null,null,null,null,null,null,{"$f":"IF(I11=\"\",\"\",IF(ISTEXT(I11),I11,IF(I11<=Basis!$M$20,\"Uit\",(100-(I11/Basis!$L$20*100))*Basis!$Y$19)))","v":""},null,null,"","","",{"$f":"IF(N11=\"\",\"\",IF(N11*60+O11>Basis!$U$20,\"Uit\",BL11+BM11))","v":""},null,"","","","","",null,7,null,"-","-","-","-","-","-","-","-","-","-","-","-","-","-","-","-","-","-","-","-","-","-","-","-","",null,null,7,null,null,null,"","","",null,{"$f":"IF(K11=\"\",\"\",IF(ISTEXT(K11),K11,IF(K11>Basis!$N$20,\"Uit\",IF(ISBLANK(L11),K11,K11+L11))))","v":""},"","",{"$f":"IF(N11=\"\",\"\",IF(BK11<=Basis!$F$20,0,(BK11-Basis!$F$20)*0.4))","v":""},{"$f":"IF(N11=\"\",\"\",IF(BK11>Basis!$G$20,0,(Basis!$G$20-BK11)*0.4))","v":""},"",null,null,null,"",""]
[null,null,8,null,null,null,null,null,null,{"$f":"IF(I12=\"\",\"\",IF(ISTEXT(I12),I12,IF(I12<=Basis!$M$20,\"Uit\",(100-(I12/Basis!$L$20*100))*Basis!$Y$19)))","v":""},null,null,"","","",{"$f":"IF(N12=\"\",\"\",IF(N12*60+O12>Basis!$U$20,\"Uit\",BL12+BM12))","v":""},null,"","","","","",null,8,null,"-","-","-","-","-","-","-","-","-","-","-","-","-","-","-","-","-","-","-","-","-","-","-","-","",null,null,8,null,null,null,"","","",null,{"$f":"IF(K12=\"\",\"\",IF(ISTEXT(K12),K12,IF(K12>Basis!$N$20,\"Uit\",IF(ISBLANK(L12),K12,K12+L12))))","v":""},"","",{"$f":"IF(N12=\"\",\"\",IF(BK12<=Basis!$F$20,0,(BK12-Basis!$F$20)*0.4))","v":""},{"$f":"IF(N12=\"\",\"\",IF(BK12>Basis!$G$20,0,(Basis!$G$20-BK12)*0.4))","v":""},"",null,null,null,"",""]
[null,null,9,null,null,null,null,null,null,{"$f":"IF(I13=\"\",\"\",IF(ISTEXT(I13),I13,IF(I13<=Basis!$M$20,\"Uit\",(100-(I13/Basis!$L$20*100))*Basis!$Y$19)))","v":""},null,null,"","","",{"$f":"IF(N13=\"\",\"\",IF(N13*60+O13>Basis!$U$20,\"Uit\",BL13+BM13))","v":""},null,"","","","","",null,9,null,"-","-","-","-","-","-","-","-","-","-","-","-","-","-","-","-","-","-","-","-","-","-","-","-","",null,null,9,null,null,null,"","","",null,{"$f":"IF(K13=\"\",\"\",IF(ISTEXT(K13),K13,IF(K13>Basis!$N$20,\"Uit\",IF(ISBLANK(L13),K13,K13+L13))))","v":""},"","",{"$f":"IF(N13=\"\",\"\",IF(BK13<=Basis!$F$20,0,(BK13-Basis!$F$20)*0.4))","v":""},{"$f":"IF(N13=\"\",\"\",IF(BK13>Basis!$G$20,0,(Basis!$G$20-BK13)*0.4))","v":""},"",null,null,null,"",""]
[null,null,10,null,null,null,null,null,null,{"$f":"IF(I14=\"\",\"\",IF(ISTEXT(I14),I14,IF(I14<=Basis!$M$20,\"Uit\",(100-(I14/Basis!$L$20*100))*Basis!$Y$19)))","v":""},null,null,"","","",{"$f":"IF(N14=\"\",\"\",IF(N14*60+O14>Basis!$U$20,\"Uit\",BL14+BM14))","v":""},null,"","","","","",null,10,null,"-","-","-","-","-","-","-","-","-","-","-","-","-","-","-","-","-","-","-","-","-","-","-","-","",null,null,10,null,null,null,"","","",null,{"$f":"IF(K14=\"\",\"\",IF(ISTEXT(K14),K14,IF(K14>Basis!$N$20,\"Uit\",IF(ISBLANK(L14),K14,K14+L14))))","v":""},"","",{"$f":"IF(N14=\"\",\"\",IF(BK14<=Basis!$F$20,0,(BK14-Basis!$F$20)*0.4))","v":""},{"$f":"IF(N14=\"\",\"\",IF(BK14>Basis!$G$20,0,(Basis!$G$20-BK14)*0.4))","v":""},"",null,null,null,"",""]
[null,null,null,null,null,null,null,null,null,{"$f":"IF(I15=\"\",\"\",IF(ISTEXT(I15),I15,IF(I15<=Basis!$M$20,\"Uit\",(100-(I15/Basis!$L$20*100))*Basis!$Y$19)))","v":""},null,null,"","","",{"$f":"IF(N15=\"\",\"\",IF(N15*60+O15>Basis!$U$20,\"Uit\",BL15+BM15))","v":""},null,"","","","","",null,"",null,"-","-","-","-","-","-","-","-","-","-","-","-","-","-","-","-","-","-","-","-","-","-","-","-","",null,null,"",null,null,null,"","","",null,{"$f":"IF(K15=\"\",\"\",IF(ISTEXT(K15),K15,IF(K15>Basis!$N$20,\"Uit\",IF(ISBLANK(L15),K15,K15+L15))))","v":""},"","",{"$f":"IF(N15=\"\",\"\",IF(BK15<=Basis!$F$20,0,(BK15-Basis!$F$20)*0.4))","v":""},{"$f":"IF(N15=\"\",\"\",IF(BK15>Basis!$G$20,0,(Basis!$G$20-BK15)*0.4))","v":""},"",null,null,null,"",""]
[null,null,null,null,null,null,null,null,null,{"$f":"IF(I16=\"\",\"\",IF(ISTEXT(I16),I16,IF(I16<=Basis!$M$20,\"Uit\",(100-(I16/Basis!$L$20*100))*Basis!$Y$19)))","v":""},null,null,"","","",{"$f":"IF(N16=\"\",\"\",IF(N16*60+O16>Basis!$U$20,\"Uit\",BL16+BM16))","v":""},null,"","","","","",null,"",null,"-","-","-","-","-","-","-","-","-","-","-","-","-","-","-","-","-","-","-","-","-","-","-","-","",null,null,"",null,null,null,"","","",null,{"$f":"IF(K16=\"\",\"\",IF(ISTEXT(K16),K16,IF(K16>Basis!$N$20,\"Uit\",IF(ISBLANK(L16),K16,K16+L16))))","v":""},"","",{"$f":"IF(N16=\"\",\"\",IF(BK16<=Basis!$F$20,0,(BK16-Basis!$F$20)*0.4))","v":""},{"$f":"IF(N16=\"\",\"\",IF(BK16>Basis!$G$20,0,(Basis!$G$20-BK16)*0.4))","v":""},"",null,null,null,"",""]
[null,null,null,null,null,null,null,null,null,{"$f":"IF(I17=\"\",\"\",IF(ISTEXT(I17),I17,IF(I17<=Basis!$M$20,\"Uit\",(100-(I17/Basis!$L$20*100))*Basis!$Y$19)))","v":""},null,null,"","","",{"$f":"IF(N17=\"\",\"\",IF(N17*60+O17>Basis!$U$20,\"Uit\",BL17+BM17))","v":""},null,"","","","","",null,"",null,"-","-","-","-","-","-","-","-","-","-","-","-","-","-","-","-","-","-","-","-","-","-","-","-","",null,null,"",null,null,null,"","","",null,{"$f":"IF(K17=\"\",\"\",IF(ISTEXT(K17),K17,IF(K17>Basis!$N$20,\"Uit\",IF(ISBLANK(L17),K17,K17+L17))))","v":""},"","",{"$f":"IF(N17=\"\",\"\",IF(BK17<=Basis!$F$20,0,(BK17-Basis!$F$20)*0.4))","v":""},{"$f":"IF(N17=\"\",\"\",IF(BK17>Basis!$G$20,0,(Basis!$G$20-BK17)*0.4))","v":""},"",null,null,null,"",""]
[null,null,null,null,null,null,null,null,null,{"$f":"IF(I18=\"\",\"\",IF(ISTEXT(I18),I18,IF(I18<=Basis!$M$20,\"Uit\",(100-(I18/Basis!$L$20*100))*Basis!$Y$19)))","v":""},null,null,"","","",{"$f":"IF(N18=\"\",\"\",IF(N18*60+O18>Basis!$U$20,\"Uit\",BL18+BM18))","v":""},null,"","","","","",null,"",null,"-","-","-","-","-","-","-","-","-","-","-","-","-","-","-","-","-","-","-","-","-","-","-","-","",null,null,"",null,null,null,"","","",null,{"$f":"IF(K18=\"\",\"\",IF(ISTEXT(K18),K18,IF(K18>Basis!$N$20,\"Uit\",IF(ISBLANK(L18),K18,K18+L18))))","v":""},"","",{"$f":"IF(N18=\"\",\"\",IF(BK18<=Basis!$F$20,0,(BK18-Basis!$F$20)*0.4))","v":""},{"$f":"IF(N18=\"\",\"\",IF(BK18>Basis!$G$20,0,(Basis!$G$20-BK18)*0.4))","v":""},"",null,null,null,"",""]
[null,null,null,null,null,null,null,null,null,{"$f":"IF(I19=\"\",\"\",IF(ISTEXT(I19),I19,IF(I19<=Basis!$M$20,\"Uit\",(100-(I19/Basis!$L$20*100))*Basis!$Y$19)))","v":""},null,null,"","","",{"$f":"IF(N19=\"\",\"\",IF(N19*60+O19>Basis!$U$20,\"Uit\",BL19+BM19))","v":""},null,"","","","","",null,"",null,"-","-","-","-","-","-","-","-","-","-","-","-","-","-","-","-","-","-","-","-","-","-","-","-","",null,null,"",null,null,null,"","","",null,{"$f":"IF(K19=\"\",\"\",IF(ISTEXT(K19),K19,IF(K19>Basis!$N$20,\"Uit\",IF(ISBLANK(L19),K19,K19+L19))))","v":""},"","",{"$f":"IF(N19=\"\",\"\",IF(BK19<=Basis!$F$20,0,(BK19-Basis!$F$20)*0.4))","v":""},{"$f":"IF(N19=\"\",\"\",IF(BK19>Basis!$G$20,0,(Basis!$G$20-BK19)*0.4))","v":""},"",null,null,null,"",""]
[null,null,null,null,null,null,null,null,null,{"$f":"IF(I20=\"\",\"\",IF(ISTEXT(I20),I20,IF(I20<=Basis!$M$20,\"Uit\",(100-(I20/Basis!$L$20*100))*Basis!$Y$19)))","v":""},null,null,"","","",{"$f":"IF(N20=\"\",\"\",IF(N20*60+O20>Basis!$U$20,\"Uit\",BL20+BM20))","v":""},null,"","","","","",null,"",null,"-","-","-","-","-","-","-","-","-","-","-","-","-","-","-","-","-","-","-","-","-","-","-","-","",null,null,"",null,null,null,"","","",null,{"$f":"IF(K20=\"\",\"\",IF(ISTEXT(K20),K20,IF(K20>Basis!$N$20,\"Uit\",IF(ISBLANK(L20),K20,K20+L20))))","v":""},"","",{"$f":"IF(N20=\"\",\"\",IF(BK20<=Basis!$F$20,0,(BK20-Basis!$F$20)*0.4))","v":""},{"$f":"IF(N20=\"\",\"\",IF(BK20>Basis!$G$20,0,(Basis!$G$20-BK20)*0.4))","v":""},"",null,null,null,"",""]
[null,null,null,null,null,null,null,null,null,{"$f":"IF(I21=\"\",\"\",IF(ISTEXT(I21),I21,IF(I21<=Basis!$M$20,\"Uit\",(100-(I21/Basis!$L$20*100))*Basis!$Y$19)))","v":""},null,null,"","","",{"$f":"IF(N21=\"\",\"\",IF(N21*60+O21>Basis!$U$20,\"Uit\",BL21+BM21))","v":""},null,"","","","","",null,"",null,"-","-","-","-","-","-","-","-","-","-","-","-","-","-","-","-","-","-","-","-","-","-","-","-","",null,null,"",null,null,null,"","","",null,{"$f":"IF(K21=\"\",\"\",IF(ISTEXT(K21),K21,IF(K21>Basis!$N$20,\"Uit\",IF(ISBLANK(L21),K21,K21+L21))))","v":""},"","",{"$f":"IF(N21=\"\",\"\",IF(BK21<=Basis!$F$20,0,(BK21-Basis!$F$20)*0.4))","v":""},{"$f":"IF(N21=\"\",\"\",IF(BK21>Basis!$G$20,0,(Basis!$G$20-BK21)*0.4))","v":""},"",null,null,null,"",""]
[null,null,null,null,null,null,null,null,null,{"$f":"IF(I22=\"\",\"\",IF(ISTEXT(I22),I22,IF(I22<=Basis!$M$20,\"Uit\",(100-(I22/Basis!$L$20*100))*Basis!$Y$19)))","v":""},null,null,"","","",{"$f":"IF(N22=\"\",\"\",IF(N22*60+O22>Basis!$U$20,\"Uit\",BL22+BM22))","v":""},null,"","","","","",null,"",null,"-","-","-","-","-","-","-","-","-","-","-","-","-","-","-","-","-","-","-","-","-","-","-","-","",null,null,"",null,null,null,"","","",null,{"$f":"IF(K22=\"\",\"\",IF(ISTEXT(K22),K22,IF(K22>Basis!$N$20,\"Uit\",IF(ISBLANK(L22),K22,K22+L22))))","v":""},"","",{"$f":"IF(N22=\"\",\"\",IF(BK22<=Basis!$F$20,0,(BK22-Basis!$F$20)*0.4))","v":""},{"$f":"IF(N22=\"\",\"\",IF(BK22>Basis!$G$20,0,(Basis!$G$20-BK22)*0.4))","v":""},"",null,null,null,"",""]
[null,null,null,null,null,null,null,null,null,{"$f":"IF(I23=\"\",\"\",IF(ISTEXT(I23),I23,IF(I23<=Basis!$M$20,\"Uit\",(100-(I23/Basis!$L$20*100))*Basis!$Y$19)))","v":""},null,null,"","","",{"$f":"IF(N23=\"\",\"\",IF(N23*60+O23>Basis!$U$20,\"Uit\",BL23+BM23))","v":""},null,"","","","","",null,"",null,"-","-","-","-","-","-","-","-","-","-","-","-","-","-","-","-","-","-","-","-","-","-","-","-","",null,null,"",null,null,null,"","","",null,{"$f":"IF(K23=\"\",\"\",IF(ISTEXT(K23),K23,IF(K23>Basis!$N$20,\"Uit\",IF(ISBLANK(L23),K23,K23+L23))))","v":""},"","",{"$f":"IF(N23=\"\",\"\",IF(BK23<=Basis!$F$20,0,(BK23-Basis!$F$20)*0.4))","v":""},{"$f":"IF(N23=\"\",\"\",IF(BK23>Basis!$G$20,0,(Basis!$G$20-BK23)*0.4))","v":""},"",null,null,null,"",""]
[null,null,null,null,null,null,null,null,null,{"$f":"IF(I24=\"\",\"\",IF(ISTEXT(I24),I24,IF(I24<=Basis!$M$20,\"Uit\",(100-(I24/Basis!$L$20*100))*Basis!$Y$19)))","v":""},null,null,"","","",{"$f":"IF(N24=\"\",\"\",IF(N24*60+O24>Basis!$U$20,\"Uit\",BL24+BM24))","v":""},null,"","","","","",null,"",null,"-","-","-","-","-","-","-","-","-","-","-","-","-","-","-","-","-","-","-","-","-","-","-","-","",null,null,"",null,null,null,"","","",null,{"$f":"IF(K24=\"\",\"\",IF(ISTEXT(K24),K24,IF(K24>Basis!$N$20,\"Uit\",IF(ISBLANK(L24),K24,K24+L24))))","v":""},"","",{"$f":"IF(N24=\"\",\"\",IF(BK24<=Basis!$F$20,0,(BK24-Basis!$F$20)*0.4))","v":""},{"$f":"IF(N24=\"\",\"\",IF(BK24>Basis!$G$20,0,(Basis!$G$20-BK24)*0.4))","v":""},"",null,null,null,"",""]
[null,null,null,null,null,null,null,null,null,{"$f":"IF(I25=\"\",\"\",IF(ISTEXT(I25),I25,IF(I25<=Basis!$M$20,\"Uit\",(100-(I25/Basis!$L$20*100))*Basis!$Y$19)))","v":""},null,null,"","","",{"$f":"IF(N25=\"\",\"\",IF(N25*60+O25>Basis!$U$20,\"Uit\",BL25+BM25))","v":""},null,"","","","","",null,"",null,"-","-","-","-","-","-","-","-","-","-","-","-","-","-","-","-","-","-","-","-","-","-","-","-","",null,null,"",null,null,null,"","","",null,{"$f":"IF(K25=\"\",\"\",IF(ISTEXT(K25),K25,IF(K25>Basis!$N$20,\"Uit\",IF(ISBLANK(L25),K25,K25+L25))))","v":""},"","",{"$f":"IF(N25=\"\",\"\",IF(BK25<=Basis!$F$20,0,(BK25-Basis!$F$20)*0.4))","v":""},{"$f":"IF(N25=\"\",\"\",IF(BK25>Basis!$G$20,0,(Basis!$G$20-BK25)*0.4))","v":""},"",null,null,null,"",""]
[null,null,null,null,null,null,null,null,null,{"$f":"IF(I26=\"\",\"\",IF(ISTEXT(I26),I26,IF(I26<=Basis!$M$20,\"Uit\",(100-(I26/Basis!$L$20*100))*Basis!$Y$19)))","v":""},null,null,"","","",{"$f":"IF(N26=\"\",\"\",IF(N26*60+O26>Basis!$U$20,\"Uit\",BL26+BM26))","v":""},null,"","","","","",null,"",null,"-","-","-","-","-","-","-","-","-","-","-","-","-","-","-","-","-","-","-","-","-","-","-","-","",null,null,"",null,null,null,"","","",null,{"$f":"IF(K26=\"\",\"\",IF(ISTEXT(K26),K26,IF(K26>Basis!$N$20,\"Uit\",IF(ISBLANK(L26),K26,K26+L26))))","v":""},"","",{"$f":"IF(N26=\"\",\"\",IF(BK26<=Basis!$F$20,0,(BK26-Basis!$F$20)*0.4))","v":""},{"$f":"IF(N26=\"\",\"\",IF(BK26>Basis!$G$20,0,(Basis!$G$20-BK26)*0.4))","v":""},"",null,null,null,"",""]
[null,null,null,null,null,null,null,null,null,{"$f":"IF(I27=\"\",\"\",IF(ISTEXT(I27),I27,IF(I27<=Basis!$M$20,\"Uit\",(100-(I27/Basis!$L$20*100))*Basis!$Y$19)))","v":""},null,null,"","","",{"$f":"IF(N27=\"\",\"\",IF(N27*60+O27>Basis!$U$20,\"Uit\",BL27+BM27))","v":""},null,"","","","","",null,"",null,"-","-","-","-","-","-","-","-","-","-","-","-","-","-","-","-","-","-","-","-","-","-","-","-","",null,null,"",null,null,null,"","","",null,{"$f":"IF(K27=\"\",\"\",IF(ISTEXT(K27),K27,IF(K27>Basis!$N$20,\"Uit\",IF(ISBLANK(L27),K27,K27+L27))))","v":""},"","",{"$f":"IF(N27=\"\",\"\",IF(BK27<=Basis!$F$20,0,(BK27-Basis!$F$20)*0.4))","v":""},{"$f":"IF(N27=\"\",\"\",IF(BK27>Basis!$G$20,0,(Basis!$G$20-BK27)*0.4))","v":""},"",null,null,null,"",""]
[null,null,null,null,null,null,null,null,null,{"$f":"IF(I28=\"\",\"\",IF(ISTEXT(I28),I28,IF(I28<=Basis!$M$20,\"Uit\",(100-(I28/Basis!$L$20*100))*Basis!$Y$19)))","v":""},null,null,"","","",{"$f":"IF(N28=\"\",\"\",IF(N28*60+O28>Basis!$U$20,\"Uit\",BL28+BM28))","v":""},null,"","","","","",null,"",null,"-","-","-","-","-","-","-","-","-","-","-","-","-","-","-","-","-","-","-","-","-","-","-","-","",null,null,"",null,null,null,"","","",null,{"$f":"IF(K28=\"\",\"\",IF(ISTEXT(K28),K28,IF(K28>Basis!$N$20,\"Uit\",IF(ISBLANK(L28),K28,K28+L28))))","v":""},"","",{"$f":"IF(N28=\"\",\"\",IF(BK28<=Basis!$F$20,0,(BK28-Basis!$F$20)*0.4))","v":""},{"$f":"IF(N28=\"\",\"\",IF(BK28>Basis!$G$20,0,(Basis!$G$20-BK28)*0.4))","v":""},"",null,null,null,"",""]
[null,null,null,null,null,null,null,null,null,{"$f":"IF(I29=\"\",\"\",IF(ISTEXT(I29),I29,IF(I29<=Basis!$M$20,\"Uit\",(100-(I29/Basis!$L$20*100))*Basis!$Y$19)))","v":""},null,null,"","","",{"$f":"IF(N29=\"\",\"\",IF(N29*60+O29>Basis!$U$20,\"Uit\",BL29+BM29))","v":""},null,"","","","","",null,"",null,"-","-","-","-","-","-","-","-","-","-","-","-","-","-","-","-","-","-","-","-","-","-","-","-","",null,null,"",null,null,null,"","","",null,{"$f":"IF(K29=\"\",\"\",IF(ISTEXT(K29),K29,IF(K29>Basis!$N$20,\"Uit\",IF(ISBLANK(L29),K29,K29+L29))))","v":""},"","",{"$f":"IF(N29=\"\",\"\",IF(BK29<=Basis!$F$20,0,(BK29-Basis!$F$20)*0.4))","v":""},{"$f":"IF(N29=\"\",\"\",IF(BK29>Basis!$G$20,0,(Basis!$G$20-BK29)*0.4))","v":""},"",null,null,null,"",""]
["  Bij uitsluiting reden vermelden : ",null,null,null,null,null,null,null,null,null,null,null,null,null,null,{"$f":"NOW()","v":"2018-06-30T22:02:24.880"},null,null,null,null,null,null,null,{"$f":"A30","v":"  Bij uitsluiting reden vermelden : "},null,null,null,null,null,null,null,null,null,null,null,null,null,null,null,null,null,null,null,null,null,null,{"$f":"NOW()","v":"2018-06-30T22:02:24.880"}]
["  VP=val paard, VR=val ruiter, 3W=3 weigeringen op zelfde hindernis, 4W=4 weigeringen totaal, FP=foutief parcours, Vr.v= vrijwillig verlaten",null,null,null,null,null,null,null,null,null,null,null,null,null,null,null,null,null,null,null,null,null,null,{"$f":"A31","v":"  VP=val paard, VR=val ruiter, 3W=3 weigeringen op zelfde hindernis, 4W=4 weigeringen totaal, FP=foutief parcours, Vr.v= vrijwillig verlaten"}]

{"sheet":"Ring 3 - L-DE","index":13,"n_rows":16,"n_cols":66,"rows_kept":16,"cut":false,"hidden":false,"merged":[[2,13,2,14],[14,15,14,21],[14,46,14,52]]}
[{"$f":"\" Samengestelde wedstrijd \"&Basis!D18","v":" Samengestelde wedstrijd Eventing Leende 30 juni 2018"},null,null,null,null,null,"Klasse L - Cat DE - Ring 3",null,null,null,null,"Dressuurjury : ","Doortje Herk",null,null,null,null,null,null,null,null,null,null," Verzamelstaat hindernisfouten in de cross",null,null,null,null,null,null,null,null,null,null,null,null,{"$f":"A1","v":" Samengestelde wedstrijd Eventing Leende 30 juni 2018"},null,null,null,null,null,null,null,null,null,null,null,null,null,null,null,{"$f":"G1&\" \"","v":"Klasse L - Cat DE - Ring 3 "},null," Indien aankomstUUR cross wordt meegedeeld :",null,null,null,null,null," Hulpkolommen"]
["rank","pony","rugnr","combinatie nr","naam ruiter","naam pony","vereniging / plaats",null,"dressuur","dressuur","hind.ft.","tijd.ft.","hind.ft.","min","sec","tijd.ft.",null,"totaal","(1) stijl","(2) stijl","eind-","reden",null,null,"hindernisnummer",null,null,null,null,null,null,null,null,null,null,null,null,null,null,null,null,null,null,null,null,null,null,null,null,null," ",null,null,null,null,null,null,null,null,null,"Uitslag","NA","tijd (sec)","tijd.ft.","reg.ft.","totaal"]
["HC","cat.",null,null,null,null,null,null,"totaal","strafpntn.","springen","springen","cross","cross",null,{"$f":"Basis!$H$25&\":\"&TEXT(Basis!$I$25,\"00\")","v":"3:40"},null,null,"cijfer","cijfer","totaal","uitsluiting",null,"nr",1,2,3,4,5,6,7,8,"VD",9,"VD",10,11,12,"13ab",14,15,"F",null,null,null,null,null,null,null,"totaal","reden uitsluiting","hind.","nr",null,"Vertrekuur","Aankomst","Tijd","Minuten","Seconden",null,"Springen","Springen","cross","opt.tijd =",{"$f":"Basis!$H$25&\":\"&TEXT(Basis!$I$25,\"00\")","v":"3:40"},"cross"]
[null,null,null,null,null,null,null,null,null,null,null,null,null,null,null,null,null,{"$f":"IF(ISBLANK(I4),\"\",IF(AND(ISBLANK(K4),ISBLANK(Y4)),J4,IF(ISTEXT(K4),K4,IF(OR(ISBLANK(M4),M4=\"\"),J4+K4+L4,IF(ISTEXT(M4),M4,IF(ISBLANK(Y4),J4+K4+L4,J4+K4+L4+M4+P4+Q4))))))","v":""}]
[1,"E",114,"808140VO","Nanke Oosterink","Vivid","PC. Hummelo",null,203.5,{"$f":"IF(I5=\"\",\"\",IF(ISTEXT(I5),I5,IF(I5<=Basis!$M$25,\"Uit\",(100-(I5/Basis!$L$25*100))*Basis!$Y$19)))","v":32.166666666666671},0,0,{"$f":"IF(AX5=\"\",\"\",AX5)","v":0},{"$f":"IF(ISBLANK(BD5),\"\",BF5)","v":3},{"$f":"IF(ISBLANK(BD5),\"\",BG5)","v":43},{"$f":"IF(N5=\"\",\"\",IF(N5*60+O5>Basis!$U$25,\"Uit\",BL5+BM5))","v":1.2000000000000002},null,{"$f":"IF(ISTEXT(BJ5),BJ5,IF(OR(ISBLANK(M5),M5=\"\",ISBLANK(Y5)),BJ5,IF(ISTEXT(BN5),BN5,BJ5+BN5)))","v":33.366666666666674},null,null,{"$f":"IF(R5=\"\",\"\",IF(ISTEXT(R5),R5,R5-S5-T5))","v":33.366666666666674},{"$f":"IF(AY5=\"\",\"\",AY5)","v":""},null,{"$f":"IF($C5=\"\",\"\",$C5)","v":114},0,"-","-","-","-","-","-","-","-","-","-","-","-","-","-","-","-","-",null,null,null,null,null,null,null,{"$f":"IF(Y5=\"\",\"\",IF(ISTEXT(Y5),Y5,SUM(Y5:AW5)))","v":0},null,null,{"$f":"IF($C5=\"\",\"\",$C5)","v":114},null,"14:18:00","14:21:43",{"$f":"IF(ISBLANK(BD5),\"\",BD5-BC5)","v":"00:03:43"},{"$f":"IF(ISBLANK(BD5),\"\",MINUTE(BE5))","v":3},{"$f":"IF(ISBLANK(BD5),\"\",SECOND(BE5))","v":43},null,{"$f":"IF(K5=\"\",\"\",IF(ISTEXT(K5),K5,IF(K5>Basis!$N$25,\"Uit\",IF(ISBLANK(L5),K5,K5+L5))))","v":0},{"$f":"IF(OR(ISTEXT(J5),BI5=\"\"),J5,IF(ISTEXT(BI5),BI5,J5+BI5))","v":32.166666666666671},{"$f":"IF(N5=\"\",\"\",N5*60+O5)","v":223},{"$f":"IF(N5=\"\",\"\",IF(BK5<=Basis!$F$25,0,(BK5-Basis!$F$25)*0.4))","v":1.2000000000000002},{"$f":"IF(N5=\"\",\"\",IF(BK5>Basis!$G$25,0,(Basis!$G$25-BK5)*0.4))","v":0},{"$f":"IF(M5=\"\",\"\",IF(ISTEXT(M5),M5,IF(ISTEXT(P5),P5,M5+P5)))","v":1.2000000000000002}]
[2,"D",113,"721840MH","Megan van de Heijkant","Mochito","PC. Sint Michaël (rsv.)",null,186.5,{"$f":"IF(I6=\"\",\"\",IF(ISTEXT(I6),I6,IF(I6<=Basis!$M$25,\"Uit\",(100-(I6/Basis!$L$25*100))*Basis!$Y$19)))","v":37.833333333333329},8,0,0,3,58,{"$f":"IF(N6=\"\",\"\",IF(N6*60+O6>Basis!$U$25,\"Uit\",BL6+BM6))","v":7.2},null,53.033333333333331,null,null,53.033333333333331,"",null,113,0,"-","-","-","-","-","-","-","-","-","-","-","-","-","-","-","-","-",null,null,null,null,null,null,null,0,null,null,113,null,"14:16:00","14:19:58","00:03:58",3,58,null,{"$f":"IF(K6=\"\",\"\",IF(ISTEXT(K6),K6,IF(K6>Basis!$N$25,\"Uit\",IF(ISBLANK(L6),K6,K6+L6))))","v":8},45.833333333333329,238,{"$f":"IF(N6=\"\",\"\",IF(BK6<=Basis!$F$25,0,(BK6-Basis!$F$25)*0.4))","v":7.2},{"$f":"IF(N6=\"\",\"\",IF(BK6>Basis!$G$25,0,(Basis!$G$25-BK6)*0.4))","v":0},7.2]
[3,"D",112,"690206UW","Alice Weijman","Carrick","PC. Klein Maar Dapper",null,198,{"$f":"IF(I7=\"\",\"\",IF(ISTEXT(I7),I7,IF(I7<=Basis!$M$25,\"Uit\",(100-(I7/Basis!$L$25*100))*Basis!$Y$19)))","v":34},0,0,20,4,10,{"$f":"IF(N7=\"\",\"\",IF(N7*60+O7>Basis!$U$25,\"Uit\",BL7+BM7))","v":12},null,66,null,null,66,"",null,112,0,"-","-","-","-","-","-","-","-","-","-",20,"-","-","-","-","-","-",null,null,null,null,null,null,null,20,null,null,112,null,"14:14:00","14:18:10","00:04:10",4,10,null,{"$f":"IF(K7=\"\",\"\",IF(ISTEXT(K7),K7,IF(K7>Basis!$N$25,\"Uit\",IF(ISBLANK(L7),K7,K7+L7))))","v":0},34,250,{"$f":"IF(N7=\"\",\"\",IF(BK7<=Basis!$F$25,0,(BK7-Basis!$F$25)*0.4))","v":12},{"$f":"IF(N7=\"\",\"\",IF(BK7>Basis!$G$25,0,(Basis!$G$25-BK7)*0.4))","v":0},32]
[null,null,null,null,null,null,null,null,null,{"$f":"IF(I8=\"\",\"\",IF(ISTEXT(I8),I8,IF(I8<=Basis!$M$25,\"Uit\",(100-(I8/Basis!$L$25*100))*Basis!$Y$19)))","v":""},null,null,"","","",{"$f":"IF(N8=\"\",\"\",IF(N8*60+O8>Basis!$U$25,\"Uit\",BL8+BM8))","v":""},null,"",null,null,"","",null,"",null,null,null,null,null,null,null,null,null,null,null,null,null,null,null,null,null,null,null,null,null,null,null,null,null,"",null,null,"",null,null,null,"","","",null,{"$f":"IF(K8=\"\",\"\",IF(ISTEXT(K8),K8,IF(K8>Basis!$N$25,\"Uit\",IF(ISBLANK(L8),K8,K8+L8))))","v":""},"","",{"$f":"IF(N8=\"\",\"\",IF(BK8<=Basis!$F$25,0,(BK8-Basis!$F$25)*0.4))","v":""},{"$f":"IF(N8=\"\",\"\",IF(BK8>Basis!$G$25,0,(Basis!$G$25-BK8)*0.4))","v":""},""]
[null,"D",115,null,null,null,null,null,null,{"$f":"IF(I9=\"\",\"\",IF(ISTEXT(I9),I9,IF(I9<=Basis!$M$25,\"Uit\",(100-(I9/Basis!$L$25*100))*Basis!$Y$19)))","v":""},null,null,"","","",{"$f":"IF(N9=\"\",\"\",IF(N9*60+O9>Basis!$U$25,\"Uit\",BL9+BM9))","v":""},null,"",null,null,"","",null,115,null,null,null,null,null,null,null,null,null,null,null,null,null,null,null,null,null,null,null,null,null,null,null,null,null,"",null,null,115,null,"14:20:00",null,"","","",null,{"$f":"IF(K9=\"\",\"\",IF(ISTEXT(K9),K9,IF(K9>Basis!$N$25,\"Uit\",IF(ISBLANK(L9),K9,K9+L9))))","v":""},"","",{"$f":"IF(N9=\"\",\"\",IF(BK9<=Basis!$F$25,0,(BK9-Basis!$F$25)*0.4))","v":""},{"$f":"IF(N9=\"\",\"\",IF(BK9>Basis!$G$25,0,(Basis!$G$25-BK9)*0.4))","v":""},""]
[null,"D",110,"744460GD","Jinte van Dongen","Geralja's tommie",null,null,"NG",{"$f":"IF(I10=\"\",\"\",IF(ISTEXT(I10),I10,IF(I10<=Basis!$M$25,\"Uit\",(100-(I10/Basis!$L$25*100))*Basis!$Y$19)))","v":"NG"},null,null,"NG","","",{"$f":"IF(N10=\"\",\"\",IF(N10*60+O10>Basis!$U$25,\"Uit\",BL10+BM10))","v":""},null,"NG",null,null,"NG","",null,110,"NG","-","-","-","-","-","-","-","-","-","-","-","-","-","-","-","-","-",null,null,null,null,null,null,null,"NG",null,null,110,null,"14:10:00",null,"","","",null,{"$f":"IF(K10=\"\",\"\",IF(ISTEXT(K10),K10,IF(K10>Basis!$N$25,\"Uit\",IF(ISBLANK(L10),K10,K10+L10))))","v":""},"NG","",{"$f":"IF(N10=\"\",\"\",IF(BK10<=Basis!$F$25,0,(BK10-Basis!$F$25)*0.4))","v":""},{"$f":"IF(N10=\"\",\"\",IF(BK10>Basis!$G$25,0,(Basis!$G$25-BK10)*0.4))","v":""},"NG"]
[null,"D",116,"697290OD","Nikki Dekkers","Orchid's Xantho Diëgo ","PC. Rutger Van Herpenruiters (hsv.)",null,"NG",{"$f":"IF(I11=\"\",\"\",IF(ISTEXT(I11),I11,IF(I11<=Basis!$M$25,\"Uit\",(100-(I11/Basis!$L$25*100))*Basis!$Y$19)))","v":"NG"},null,null,"NG","","",{"$f":"IF(N11=\"\",\"\",IF(N11*60+O11>Basis!$U$25,\"Uit\",BL11+BM11))","v":""},null,"NG",null,null,"NG","",null,116,"NG","-","-","-","-","-","-","-","-","-","-","-","-","-","-","-","-","-",null,null,null,null,null,null,null,"NG",null,null,116,null,"14:22:00",null,"","","",null,{"$f":"IF(K11=\"\",\"\",IF(ISTEXT(K11),K11,IF(K11>Basis!$N$25,\"Uit\",IF(ISBLANK(L11),K11,K11+L11))))","v":""},"NG","",{"$f":"IF(N11=\"\",\"\",IF(BK11<=Basis!$F$25,0,(BK11-Basis!$F$25)*0.4))","v":""},{"$f":"IF(N11=\"\",\"\",IF(BK11>Basis!$G$25,0,(Basis!$G$25-BK11)*0.4))","v":""},"NG"]
[null,null,null,null,null,null,null,null,null,{"$f":"IF(I12=\"\",\"\",IF(ISTEXT(I12),I12,IF(I12<=Basis!$M$25,\"Uit\",(100-(I12/Basis!$L$25*100))*Basis!$Y$19)))","v":""},null,null,"","","",{"$f":"IF(N12=\"\",\"\",IF(N12*60+O12>Basis!$U$25,\"Uit\",BL12+BM12))","v":""},null,"",null,null,"","",null,"",null,null,null,null,null,null,null,null,null,null,null,null,null,null,null,null,null,null,null,null,null,null,null,null,null,"",null,null,"",null,null,null,"","","",null,{"$f":"IF(K12=\"\",\"\",IF(ISTEXT(K12),K12,IF(K12>Basis!$N$25,\"Uit\",IF(ISBLANK(L12),K12,K12+L12))))","v":""},"","",{"$f":"IF(N12=\"\",\"\",IF(BK12<=Basis!$F$25,0,(BK12-Basis!$F$25)*0.4))","v":""},{"$f":"IF(N12=\"\",\"\",IF(BK12>Basis!$G$25,0,(Basis!$G$25-BK12)*0.4))","v":""},""]
[null,null,null,null,null,null,null,null,null,{"$f":"IF(I13=\"\",\"\",IF(ISTEXT(I13),I13,IF(I13<=Basis!$M$25,\"Uit\",(100-(I13/Basis!$L$25*100))*Basis!$Y$19)))","v":""},null,null,"","","",{"$f":"IF(N13=\"\",\"\",IF(N13*60+O13>Basis!$U$25,\"Uit\",BL13+BM13))","v":""},null,"",null,null,"","",null,"",null,null,null,null,null,null,null,null,null,null,null,null,null,null,null,null,null,null,null,null,null,null,null,null,null,"",null,null,"",null,null,null,"","","",null,{"$f":"IF(K13=\"\",\"\",IF(ISTEXT(K13),K13,IF(K13>Basis!$N$25,\"Uit\",IF(ISBLANK(L13),K13,K13+L13))))","v":""},"","",{"$f":"IF(N13=\"\",\"\",IF(BK13<=Basis!$F$25,0,(BK13-Basis!$F$25)*0.4))","v":""},{"$f":"IF(N13=\"\",\"\",IF(BK13>Basis!$G$25,0,(Basis!$G$25-BK13)*0.4))","v":""},""]
[null,null,null,null,null,null,null,null,null,{"$f":"IF(I14=\"\",\"\",IF(ISTEXT(I14),I14,IF(I14<=Basis!$M$25,\"Uit\",(100-(I14/Basis!$L$25*100))*Basis!$Y$19)))","v":""},null,null,"","","",{"$f":"IF(N14=\"\",\"\",IF(N14*60+O14>Basis!$U$25,\"Uit\",BL14+BM14))","v":""},null,"",null,null,"","",null,"",null,null,null,null,null,null,null,null,null,null,null,null,null,null,null,null,null,null,null,null,null,null,null,null,null,"",null,null,"",null,null,null,"","","",null,{"$f":"IF(K14=\"\",\"\",IF(ISTEXT(K14),K14,IF(K14>Basis!$N$25,\"Uit\",IF(ISBLANK(L14),K14,K14+L14))))","v":""},"","",{"$f":"IF(N14=\"\",\"\",IF(BK14<=Basis!$F$25,0,(BK14-Basis!$F$25)*0.4))","v":""},{"$f":"IF(N14=\"\",\"\",IF(BK14>Basis!$G$25,0,(Basis!$G$25-BK14)*0.4))","v":""},""]
["  Bij uitsluiting reden vermelden : ",null,null,null,null,null,null,null,null,null,null,null,null,null,null,{"$f":"NOW()","v":"2018-06-30T22:02:24.880"},null,null,null,null,null,null,null,{"$f":"A15","v":"  Bij uitsluiting reden vermelden : "},null,null,null,null,null,null,null,null,null,null,null,null,null,null,null,null,null,null,null,null,null,null,{"$f":"NOW()","v":"2018-06-30T22:02:24.880"}]
["  VP=val paard, VR=val ruiter, 3W=3 weigeringen op zelfde hindernis, 4W=4 weigeringen totaal, FP=foutief parcours, Vr.v= vrijwillig verlaten",null,null,null,null,null,null,null,null,null,null,null,null,null,null,null,null,null,null,null,null,null,null,{"$f":"A16","v":"  VP=val paard, VR=val ruiter, 3W=3 weigeringen op zelfde hindernis, 4W=4 weigeringen totaal, FP=foutief parcours, Vr.v= vrijwillig verlaten"}]

{"sheet":"Ring 3 - L-ABC","index":14,"n_rows":14,"n_cols":66,"rows_kept":14,"cut":false,"hidden":false,"merged":[[2,13,2,14],[12,15,12,21],[12,46,12,52]]}
[{"$f":"\" Samengestelde wedstrijd \"&Basis!D18","v":" Samengestelde wedstrijd Eventing Leende 30 juni 2018"},null,null,null,null,null,"Klasse L - Cat ABC - Ring 3",null,null,null,null,"Dressuurjury : ","Doortje Herk",null,null,null,null,null,null,null,null,null,null," Verzamelstaat hindernisfouten in de cross",null,null,null,null,null,null,null,null,null,null,null,null,{"$f":"A1","v":" Samengestelde wedstrijd Eventing Leende 30 juni 2018"},null,null,null,null,null,null,null,null,null,null,null,null,null,null,null,{"$f":"G1&\" \"","v":"Klasse L - Cat ABC - Ring 3 "},null," Indien aankomstUUR cross wordt meegedeeld :",null,null,null,null,null," Hulpkolommen"]
["rank","pony","rugnr","combinatie nr","naam ruiter","naam pony","vereniging / plaats",null,"dressuur","dressuur","hind.ft.","tijd.ft.","hind.ft.","min","sec","tijd.ft.",null,"totaal","(1) stijl","(2) stijl","eind-","reden",null,null,"hindernisnummer",null,null,null,null,null,null,null,null,null,null,null,null,null,null,null,null,null,null,null,null,null,null,null,null,null," ",null,null,null,null,null,null,null,null,null,"Uitslag","NA","tijd (sec)","tijd.ft.","reg.ft.","totaal"]
["HC","cat.",null,null,null,null,null,null,"totaal","strafpntn.","springen","springen","cross","cross",null,{"$f":"Basis!$H$23&\":\"&TEXT(Basis!$I$23,\"00\")","v":"3:55"},null,null,"cijfer","cijfer","totaal","uitsluiting",null,"nr",1,2,3,4,5,6,7,8,"VD",9,"VD",10,11,12,"13ab",14,15,"F",null,null,null,null,null,null,null,"totaal","reden uitsluiting","hind.","nr",null,"Vertrekuur","Aankomst","Tijd","Minuten","Seconden",null,"Springen","Springen","cross","opt.tijd =",{"$f":"Basis!$H$23&\":\"&TEXT(Basis!$I$23,\"00\")","v":"3:55"},"cross"]
[null,null,null,null,null,null,null,null,null,null,null,null,null,null,null,null,null,{"$f":"IF(ISBLANK(I4),\"\",IF(AND(ISBLANK(K4),ISBLANK(Y4)),J4,IF(ISTEXT(K4),K4,IF(OR(ISBLANK(M4),M4=\"\"),J4+K4+L4,IF(ISTEXT(M4),M4,IF(ISBLANK(Y4),J4+K4+L4,J4+K4+L4+M4+P4+Q4))))))","v":""}]
[1,"C",119,"761467TW","Sophie Weening","Tobias","PC. 't Reelaer (hsv.)",null,188,{"$f":"IF(I5=\"\",\"\",IF(ISTEXT(I5),I5,IF(I5<=Basis!$M$24,\"Uit\",(100-(I5/Basis!$L$24*100))*Basis!$Y$19)))","v":37.333333333333329},0,0,{"$f":"IF(AX5=\"\",\"\",AX5)","v":0},{"$f":"IF(ISBLANK(BD5),\"\",BF5)","v":4},{"$f":"IF(ISBLANK(BD5),\"\",BG5)","v":12},{"$f":"IF(N5=\"\",\"\",IF(N5*60+O5>Basis!$U$24,\"Uit\",BL5+BM5))","v":6.8000000000000007},null,{"$f":"IF(ISTEXT(BJ5),BJ5,IF(OR(ISBLANK(M5),M5=\"\",ISBLANK(Y5)),BJ5,IF(ISTEXT(BN5),BN5,BJ5+BN5)))","v":44.133333333333326},null,null,{"$f":"IF(R5=\"\",\"\",IF(ISTEXT(R5),R5,R5-S5-T5))","v":44.133333333333326},{"$f":"IF(AY5=\"\",\"\",AY5)","v":""},null,{"$f":"IF($C5=\"\",\"\",$C5)","v":119},0,"-","-","-","-","-","-","-","-","-","-","-","-","-","-","-","-","-",null,null,null,null,null,null,null,{"$f":"IF(Y5=\"\",\"\",IF(ISTEXT(Y5),Y5,SUM(Y5:AW5)))","v":0},null,null,{"$f":"IF($C5=\"\",\"\",$C5)","v":119},null,"14:34:00","14:38:12",{"$f":"IF(ISBLANK(BD5),\"\",BD5-BC5)","v":"00:04:12"},{"$f":"IF(ISBLANK(BD5),\"\",MINUTE(BE5))","v":4},{"$f":"IF(ISBLANK(BD5),\"\",SECOND(BE5))","v":12},null,{"$f":"IF(K5=\"\",\"\",IF(ISTEXT(K5),K5,IF(K5>Basis!$N$23,\"Uit\",IF(ISBLANK(L5),K5,K5+L5))))","v":0},{"$f":"IF(OR(ISTEXT(J5),BI5=\"\"),J5,IF(ISTEXT(BI5),BI5,J5+BI5))","v":37.333333333333329},{"$f":"IF(N5=\"\",\"\",N5*60+O5)","v":252},{"$f":"IF(N5=\"\",\"\",IF(BK5<=Basis!$F$23,0,(BK5-Basis!$F$23)*0.4))","v":6.8000000000000007},{"$f":"IF(N5=\"\",\"\",IF(BK5>Basis!$G$23,0,(Basis!$G$23-BK5)*0.4))","v":0},{"$f":"IF(M5=\"\",\"\",IF(ISTEXT(M5),M5,IF(ISTEXT(P5),P5,M5+P5)))","v":6.8000000000000007}]
[null,"B",117,"766510JH","Louise Hooijen","Jolly Jumper","PC. Irene-Bosruiters",null,201.5,{"$f":"IF(I6=\"\",\"\",IF(ISTEXT(I6),I6,IF(I6<=Basis!$M$23,\"Uit\",(100-(I6/Basis!$L$23*100))*Basis!$Y$19)))","v":32.833333333333343},4,0,{"$f":"IF(AX6=\"\",\"\",AX6)","v":"Uit"},{"$f":"IF(ISBLANK(BD6),\"\",BF6)","v":""},{"$f":"IF(ISBLANK(BD6),\"\",BG6)","v":""},{"$f":"IF(N6=\"\",\"\",IF(N6*60+O6>Basis!$U$23,\"Uit\",BL6+BM6))","v":""},null,{"$f":"IF(ISTEXT(BJ6),BJ6,IF(OR(ISBLANK(M6),M6=\"\",ISBLANK(Y6)),BJ6,IF(ISTEXT(BN6),BN6,BJ6+BN6)))","v":"Uit"},null,null,{"$f":"IF(R6=\"\",\"\",IF(ISTEXT(R6),R6,R6-S6-T6))","v":"Uit"},{"$f":"IF(AY6=\"\",\"\",AY6)","v":"4W h.4 d*"},null,{"$f":"IF($C6=\"\",\"\",$C6)","v":117},60,20,"-","3W","-","-","-",null,null,null,null,null,null,null,null,null,null,null,null,null,null,null,null,null,null,"Uit","4W h.4 d*",null,{"$f":"IF($C6=\"\",\"\",$C6)","v":117},null,"14:30:00",null,{"$f":"IF(ISBLANK(BD6),\"\",BD6-BC6)","v":""},{"$f":"IF(ISBLANK(BD6),\"\",MINUTE(BE6))","v":""},{"$f":"IF(ISBLANK(BD6),\"\",SECOND(BE6))","v":""},null,{"$f":"IF(K6=\"\",\"\",IF(ISTEXT(K6),K6,IF(K6>Basis!$N$23,\"Uit\",IF(ISBLANK(L6),K6,K6+L6))))","v":4},{"$f":"IF(OR(ISTEXT(J6),BI6=\"\"),J6,IF(ISTEXT(BI6),BI6,J6+BI6))","v":36.833333333333343},{"$f":"IF(N6=\"\",\"\",N6*60+O6)","v":""},{"$f":"IF(N6=\"\",\"\",IF(BK6<=Basis!$F$23,0,(BK6-Basis!$F$23)*0.4))","v":""},{"$f":"IF(N6=\"\",\"\",IF(BK6>Basis!$G$23,0,(Basis!$G$23-BK6)*0.4))","v":""},{"$f":"IF(M6=\"\",\"\",IF(ISTEXT(M6),M6,IF(ISTEXT(P6),P6,M6+P6)))","v":"Uit"}]
[null,"C",118,"768171HB","Tijn de Blaauw","Hunter",null,null,169,{"$f":"IF(I7=\"\",\"\",IF(ISTEXT(I7),I7,IF(I7<=Basis!$M$24,\"Uit\",(100-(I7/Basis!$L$24*100))*Basis!$Y$19)))","v":43.666666666666664},0,0,"Uit","","",{"$f":"IF(N7=\"\",\"\",IF(N7*60+O7>Basis!$U$24,\"Uit\",BL7+BM7))","v":""},null,"Uit",null,null,"Uit","FP h.9 d*",null,118,20,"-","-",20,"-","-",20,"-","-","FP","-","-","-","-","VR",null,null,null,null,null,null,null,null,null,null,"Uit","FP h.9 d*",null,118,null,"14:32:00",null,"","","",null,{"$f":"IF(K7=\"\",\"\",IF(ISTEXT(K7),K7,IF(K7>Basis!$N$23,\"Uit\",IF(ISBLANK(L7),K7,K7+L7))))","v":0},{"$f":"IF(OR(ISTEXT(J7),BI7=\"\"),J7,IF(ISTEXT(BI7),BI7,J7+BI7))","v":43.666666666666664},{"$f":"IF(N7=\"\",\"\",N7*60+O7)","v":""},{"$f":"IF(N7=\"\",\"\",IF(BK7<=Basis!$F$23,0,(BK7-Basis!$F$23)*0.4))","v":""},{"$f":"IF(N7=\"\",\"\",IF(BK7>Basis!$G$23,0,(Basis!$G$23-BK7)*0.4))","v":""},{"$f":"IF(M7=\"\",\"\",IF(ISTEXT(M7),M7,IF(ISTEXT(P7),P7,M7+P7)))","v":"Uit"}]
[null,"C",120,null,null,null,null,null,null,{"$f":"IF(I8=\"\",\"\",IF(ISTEXT(I8),I8,IF(I8<=Basis!$M$24,\"Uit\",(100-(I8/Basis!$L$24*100))*Basis!$Y$19)))","v":""},null,null,{"$f":"IF(AX8=\"\",\"\",AX8)","v":""},{"$f":"IF(ISBLANK(BD8),\"\",BF8)","v":""},{"$f":"IF(ISBLANK(BD8),\"\",BG8)","v":""},{"$f":"IF(N8=\"\",\"\",IF(N8*60+O8>Basis!$U$24,\"Uit\",BL8+BM8))","v":""},null,"",null,null,"","",null,120,null,"-","-","-","-","-","-","-","-","-","-","-","-","-","-","-","-","-",null,null,null,null,null,null,null,{"$f":"IF(Y8=\"\",\"\",IF(ISTEXT(Y8),Y8,SUM(Y8:AW8)))","v":""},null,null,120,null,null,null,"","","",null,{"$f":"IF(K8=\"\",\"\",IF(ISTEXT(K8),K8,IF(K8>Basis!$N$23,\"Uit\",IF(ISBLANK(L8),K8,K8+L8))))","v":""},"","",{"$f":"IF(N8=\"\",\"\",IF(BK8<=Basis!$F$23,0,(BK8-Basis!$F$23)*0.4))","v":""},{"$f":"IF(N8=\"\",\"\",IF(BK8>Basis!$G$23,0,(Basis!$G$23-BK8)*0.4))","v":""},""]
[null,null,null,null,null,null,null,null,null,{"$f":"IF(I9=\"\",\"\",IF(ISTEXT(I9),I9,IF(I9<=Basis!$M$23,\"Uit\",(100-(I9/Basis!$L$23*100))*Basis!$Y$19)))","v":""},null,null,"","","",{"$f":"IF(N9=\"\",\"\",IF(N9*60+O9>Basis!$U$23,\"Uit\",BL9+BM9))","v":""},null,"",null,null,"","",null,"",null,null,null,null,null,null,null,null,null,null,null,null,null,null,null,null,null,null,null,null,null,null,null,null,null,"",null,null,"",null,null,null,"","","",null,{"$f":"IF(K9=\"\",\"\",IF(ISTEXT(K9),K9,IF(K9>Basis!$N$23,\"Uit\",IF(ISBLANK(L9),K9,K9+L9))))","v":""},"","",{"$f":"IF(N9=\"\",\"\",IF(BK9<=Basis!$F$23,0,(BK9-Basis!$F$23)*0.4))","v":""},{"$f":"IF(N9=\"\",\"\",IF(BK9>Basis!$G$23,0,(Basis!$G$23-BK9)*0.4))","v":""},""]
[null,null,null,null,null,null,null,null,null,{"$f":"IF(I10=\"\",\"\",IF(ISTEXT(I10),I10,IF(I10<=Basis!$M$23,\"Uit\",(100-(I10/Basis!$L$23*100))*Basis!$Y$19)))","v":""},null,null,"","","",{"$f":"IF(N10=\"\",\"\",IF(N10*60+O10>Basis!$U$23,\"Uit\",BL10+BM10))","v":""},null,"",null,null,"","",null,"",null,null,null,null,null,null,null,null,null,null,null,null,null,null,null,null,null,null,null,null,null,null,null,null,null,"",null,null,"",null,null,null,"","","",null,{"$f":"IF(K10=\"\",\"\",IF(ISTEXT(K10),K10,IF(K10>Basis!$N$23,\"Uit\",IF(ISBLANK(L10),K10,K10+L10))))","v":""},"","",{"$f":"IF(N10=\"\",\"\",IF(BK10<=Basis!$F$23,0,(BK10-Basis!$F$23)*0.4))","v":""},{"$f":"IF(N10=\"\",\"\",IF(BK10>Basis!$G$23,0,(Basis!$G$23-BK10)*0.4))","v":""},""]
[null,null,null,null,null,null,null,null,null,{"$f":"IF(I11=\"\",\"\",IF(ISTEXT(I11),I11,IF(I11<=Basis!$M$23,\"Uit\",(100-(I11/Basis!$L$23*100))*Basis!$Y$19)))","v":""},null,null,"","","",{"$f":"IF(N11=\"\",\"\",IF(N11*60+O11>Basis!$U$23,\"Uit\",BL11+BM11))","v":""},null,"",null,null,"","",null,"",null,null,null,null,null,null,null,null,null,null,null,null,null,null,null,null,null,null,null,null,null,null,null,null,null,"",null,null,"",null,null,null,"","","",null,{"$f":"IF(K11=\"\",\"\",IF(ISTEXT(K11),K11,IF(K11>Basis!$N$23,\"Uit\",IF(ISBLANK(L11),K11,K11+L11))))","v":""},"","",{"$f":"IF(N11=\"\",\"\",IF(BK11<=Basis!$F$23,0,(BK11-Basis!$F$23)*0.4))","v":""},{"$f":"IF(N11=\"\",\"\",IF(BK11>Basis!$G$23,0,(Basis!$G$23-BK11)*0.4))","v":""},""]
[null,null,null,null,null,null,null,null,null,{"$f":"IF(I12=\"\",\"\",IF(ISTEXT(I12),I12,IF(I12<=Basis!$M$23,\"Uit\",(100-(I12/Basis!$L$23*100))*Basis!$Y$19)))","v":""},null,null,"","","",{"$f":"IF(N12=\"\",\"\",IF(N12*60+O12>Basis!$U$23,\"Uit\",BL12+BM12))","v":""},null,"",null,null,"","",null,"",null,null,null,null,null,null,null,null,null,null,null,null,null,null,null,null,null,null,null,null,null,null,null,null,null,"",null,null,"",null,null,null,"","","",null,{"$f":"IF(K12=\"\",\"\",IF(ISTEXT(K12),K12,IF(K12>Basis!$N$23,\"Uit\",IF(ISBLANK(L12),K12,K12+L12))))","v":""},"","",{"$f":"IF(N12=\"\",\"\",IF(BK12<=Basis!$F$23,0,(BK12-Basis!$F$23)*0.4))","v":""},{"$f":"IF(N12=\"\",\"\",IF(BK12>Basis!$G$23,0,(Basis!$G$23-BK12)*0.4))","v":""},""]
["  Bij uitsluiting reden vermelden : ",null,null,null,null,null,null,null,null,null,null,null,null,null,null,{"$f":"NOW()","v":"2018-06-30T22:02:24.880"},null,null,null,null,null,null,null,{"$f":"A13","v":"  Bij uitsluiting reden vermelden : "},null,null,null,null,null,null,null,null,null,null,null,null,null,null,null,null,null,null,null,null,null,null,{"$f":"NOW()","v":"2018-06-30T22:02:24.880"}]
["  VP=val paard, VR=val ruiter, 3W=3 weigeringen op zelfde hindernis, 4W=4 weigeringen totaal, FP=foutief parcours, Vr.v= vrijwillig verlaten",null,null,null,null,null,null,null,null,null,null,null,null,null,null,null,null,null,null,null,null,null,null,{"$f":"A14","v":"  VP=val paard, VR=val ruiter, 3W=3 weigeringen op zelfde hindernis, 4W=4 weigeringen totaal, FP=foutief parcours, Vr.v= vrijwillig verlaten"}]

{"sheet":"BB Paarden","index":15,"n_rows":26,"n_cols":71,"rows_kept":26,"cut":false,"hidden":false,"merged":[[2,13,2,14],[24,15,24,21],[24,46,24,52]]}
[{"$f":"\" Samengestelde wedstrijd \"&Basis!D5","v":" Samengestelde wedstrijd Eventing Leende 30 juni 2018"},null,null,null,null,null,"Klasse BB paarden",null,null,null,"Dressuurjury : ","nvt",null,null,null,null,null,null,null,null,null,null,null," Verzamelstaat hindernisfouten in de cross",null,null,null,null,null,null,null,null,null,null,null,null,{"$f":"A1","v":" Samengestelde wedstrijd Eventing Leende 30 juni 2018"},null,null,null,null,null,null,null,null,null,null,null,null,null,null,null,{"$f":"G1&\" \"","v":"Klasse BB paarden "},null," Indien aankomstUUR cross wordt meegedeeld :",null,null,null,null,null," Hulpkolommen",null,null,null,null,null,null," Stijlcijfers :"]
["rank",null,"rugnr","combinatie nr","naam ruiter","naam paard","vereniging / plaats",null,"dressuur","dressuur","hind.ft.","tijd.ft.","hind.ft.","min","sec","tijd.ft.",null,"totaal","(1) stijl","(2) stijl","eind-","reden",null,null,"hindernisnummer",null,null,null,null,null,null,null,null,null,null,null,null,null,null,null,null,null,null,null,null,null,null,null,null,null," ",null,null,null,null,null,null,null,null,null,"Uitslag","NA","tijd (sec)","tijd.ft.","reg.ft.","totaal",null,"Totaal","Totaal","Gemiddelde","Gemiddelde"]
["HC",null,null,null,null,null,null,null,"totaal","strafpntn.","springen","springen","cross","cross",null,{"$f":"Basis!$H$8&\":\"&TEXT(Basis!$I$8,\"00\")","v":"3:40"},null,null,"cijfer","cijfer","totaal","uitsluiting",null,"nr",1,2,3,4,5,6,"VD",7,"VD","8ab",9,"10ab",11,12,"F",null,null,null,null,null,null,null,null,null,null,"totaal","reden uitsluiting","hind.","nr",null,"Vertrekuur","Aankomst","Tijd","Minuten","Seconden",null,"Springen","Springen","cross","opt.tijd =",{"$f":"Basis!$H$8&\":\"&TEXT(Basis!$I$8,\"00\")","v":"3:40"},"cross",null,"Jury 1","Jury 2","Jury 1","Jury 2"]
[null,null,null,null,null,null,null,null,null,null,null,null,null,null,null,null,null,{"$f":"IF(ISBLANK(I4),\"\",IF(AND(ISBLANK(K4),ISBLANK(Y4)),J4,IF(ISTEXT(K4),K4,IF(OR(ISBLANK(M4),M4=\"\"),J4+K4+L4,IF(ISTEXT(M4),M4,IF(ISBLANK(Y4),J4+K4+L4,J4+K4+L4+M4+P4+Q4))))))","v":""}]
[1,null,121,null,"Majoor Bart Jan Geers","Gigi","RV. Militaire Ruitersportvereniging 'Te Paard!' *",null,150,{"$f":"IF(I5=\"\",\"\",IF(ISTEXT(I5),I5,IF(I5<=Basis!$M$8,\"Uit\",(100-(I5/Basis!$L$8*100))*Basis!$Y$6)))","v":50},0,0,{"$f":"IF(AX5=\"\",\"\",AX5)","v":0},{"$f":"IF(ISBLANK(BD5),\"\",BF5)","v":3},{"$f":"IF(ISBLANK(BD5),\"\",BG5)","v":59},{"$f":"IF(N5=\"\",\"\",IF(N5*60+O5>Basis!$U$8,\"Uit\",BL5+BM5))","v":7.6000000000000005},null,{"$f":"IF(ISTEXT(BJ5),BJ5,IF(OR(ISBLANK(M5),M5=\"\",ISBLANK(Y5)),BJ5,IF(ISTEXT(BN5),BN5,BJ5+BN5)))","v":57.6},{"$f":"IF(BP5=\"\",\"\",BR5)","v":7.166666666666667},{"$f":"IF(BQ5=\"\",\"\",BS5)","v":7.166666666666667},{"$f":"IF(R5=\"\",\"\",IF(ISTEXT(R5),R5,IF(BP5=\"\",\"\",R5-S5-T5)))","v":43.266666666666673},{"$f":"IF(AY5=\"\",\"\",AY5)","v":""},null,{"$f":"IF($C5=\"\",\"\",$C5)","v":121},0,"-","-","-","-","-","-","-","-","-","-","-","-","-","-",null,null,null,null,null,null,null,null,null,null,{"$f":"IF(Y5=\"\",\"\",IF(ISTEXT(Y5),Y5,SUM(Y5:AW5)))","v":0},null,null,{"$f":"IF($C5=\"\",\"\",$C5)","v":121},null,"15:04:00","15:07:59",{"$f":"IF(ISBLANK(BD5),\"\",BD5-BC5)","v":"00:03:59"},{"$f":"IF(ISBLANK(BD5),\"\",MINUTE(BE5))","v":3},{"$f":"IF(ISBLANK(BD5),\"\",SECOND(BE5))","v":59},null,{"$f":"IF(K5=\"\",\"\",IF(ISTEXT(K5),K5,IF(K5>Basis!$N$8,\"Uit\",IF(ISBLANK(L5),K5,K5+L5))))","v":0},{"$f":"IF(OR(ISTEXT(J5),BI5=\"\"),J5,IF(ISTEXT(BI5),BI5,J5+BI5))","v":50},{"$f":"IF(N5=\"\",\"\",N5*60+O5)","v":239},{"$f":"IF(N5=\"\",\"\",IF(BK5<=Basis!$F$8,0,(BK5-Basis!$F$8)*0.4))","v":7.6000000000000005},{"$f":"IF(N5=\"\",\"\",IF(BK5>Basis!$G$8,0,(Basis!$G$8-BK5)*0.4))","v":0},{"$f":"IF(M5=\"\",\"\",IF(ISTEXT(M5),M5,IF(ISTEXT(P5),P5,M5+P5)))","v":7.6000000000000005},null,21.5,21.5,{"$f":"IF(BP5=\"\",\"\",BP5/3)","v":7.166666666666667},{"$f":"IF(BQ5=\"\",\"\",BQ5/3)","v":7.166666666666667}]
[2,null,131,null,"Marieke Nowee","Furenda",null,null,150,{"$f":"IF(I6=\"\",\"\",IF(ISTEXT(I6),I6,IF(I6<=Basis!$M$8,\"Uit\",(100-(I6/Basis!$L$8*100))*Basis!$Y$6)))","v":50},0,0,0,4,27,{"$f":"IF(N6=\"\",\"\",IF(N6*60+O6>Basis!$U$8,\"Uit\",BL6+BM6))","v":18.8},null,68.8,7.833333333333333,7.333333333333333,53.633333333333326,"",null,131,0,"-","-","-","-","-","-","-","-","-","-","-","-","-","-",null,null,null,null,null,null,null,null,null,null,{"$f":"IF(Y6=\"\",\"\",IF(ISTEXT(Y6),Y6,SUM(Y6:AW6)))","v":0},null,null,131,null,"15:24:00","15:28:27","00:04:27",4,27,null,{"$f":"IF(K6=\"\",\"\",IF(ISTEXT(K6),K6,IF(K6>Basis!$N$8,\"Uit\",IF(ISBLANK(L6),K6,K6+L6))))","v":0},50,267,{"$f":"IF(N6=\"\",\"\",IF(BK6<=Basis!$F$8,0,(BK6-Basis!$F$8)*0.4))","v":18.8},{"$f":"IF(N6=\"\",\"\",IF(BK6>Basis!$G$8,0,(Basis!$G$8-BK6)*0.4))","v":0},18.8,null,23.5,22,7.833333333333333,7.333333333333333]
[3,null,124,null,"Marlissa Opneneer","Nashita Zarascha","RV. Prins Maurits",null,150,{"$f":"IF(I7=\"\",\"\",IF(ISTEXT(I7),I7,IF(I7<=Basis!$M$8,\"Uit\",(100-(I7/Basis!$L$8*100))*Basis!$Y$6)))","v":50},4,0,0,4,22,{"$f":"IF(N7=\"\",\"\",IF(N7*60+O7>Basis!$U$8,\"Uit\",BL7+BM7))","v":16.8},null,70.8,7.833333333333333,6.333333333333333,56.633333333333326,"",null,124,0,"-","-","-","-","-","-","-","-","-","-","-","-","-","-",null,null,null,null,null,null,null,null,null,null,{"$f":"IF(Y7=\"\",\"\",IF(ISTEXT(Y7),Y7,SUM(Y7:AW7)))","v":0},null,null,124,null,"15:30:00","15:34:22","00:04:22",4,22,null,{"$f":"IF(K7=\"\",\"\",IF(ISTEXT(K7),K7,IF(K7>Basis!$N$8,\"Uit\",IF(ISBLANK(L7),K7,K7+L7))))","v":4},54,262,{"$f":"IF(N7=\"\",\"\",IF(BK7<=Basis!$F$8,0,(BK7-Basis!$F$8)*0.4))","v":16.8},{"$f":"IF(N7=\"\",\"\",IF(BK7>Basis!$G$8,0,(Basis!$G$8-BK7)*0.4))","v":0},16.8,null,23.5,19,7.833333333333333,6.333333333333333]
[4,null,135,null,"Leonie van Bekhoven","Gandhi",null,null,150,{"$f":"IF(I8=\"\",\"\",IF(ISTEXT(I8),I8,IF(I8<=Basis!$M$8,\"Uit\",(100-(I8/Basis!$L$8*100))*Basis!$Y$6)))","v":50},0,3,0,4,36,{"$f":"IF(N8=\"\",\"\",IF(N8*60+O8>Basis!$U$8,\"Uit\",BL8+BM8))","v":22.400000000000002},null,75.400000000000006,7.166666666666667,7.166666666666667,61.06666666666667,"",null,135,0,"-","-","-","-","-","-","-","-","-","-","-","-","-","-",null,null,null,null,null,null,null,null,null,null,{"$f":"IF(Y8=\"\",\"\",IF(ISTEXT(Y8),Y8,SUM(Y8:AW8)))","v":0},null,null,135,null,"15:32:00","15:36:36","00:04:36",4,36,null,{"$f":"IF(K8=\"\",\"\",IF(ISTEXT(K8),K8,IF(K8>Basis!$N$8,\"Uit\",IF(ISBLANK(L8),K8,K8+L8))))","v":3},53,276,{"$f":"IF(N8=\"\",\"\",IF(BK8<=Basis!$F$8,0,(BK8-Basis!$F$8)*0.4))","v":22.400000000000002},{"$f":"IF(N8=\"\",\"\",IF(BK8>Basis!$G$8,0,(Basis!$G$8-BK8)*0.4))","v":0},22.400000000000002,null,21.5,21.5,7.166666666666667,7.166666666666667]
[5,null,133,null,"Alexandra Vandamme","Delia Mail",null,null,150,{"$f":"IF(I9=\"\",\"\",IF(ISTEXT(I9),I9,IF(I9<=Basis!$M$8,\"Uit\",(100-(I9/Basis!$L$8*100))*Basis!$Y$6)))","v":50},0,0,0,5,34,{"$f":"IF(N9=\"\",\"\",IF(N9*60+O9>Basis!$U$8,\"Uit\",BL9+BM9))","v":45.6},null,95.6,7,7.166666666666667,81.433333333333323,"",null,133,0,"-","-","-","-","-","-","-","-","-","-","-","-","-","-",null,null,null,null,null,null,null,null,null,null,{"$f":"IF(Y9=\"\",\"\",IF(ISTEXT(Y9),Y9,SUM(Y9:AW9)))","v":0},null,null,133,null,"15:28:00","15:33:34","00:05:34",5,34,null,{"$f":"IF(K9=\"\",\"\",IF(ISTEXT(K9),K9,IF(K9>Basis!$N$8,\"Uit\",IF(ISBLANK(L9),K9,K9+L9))))","v":0},50,334,{"$f":"IF(N9=\"\",\"\",IF(BK9<=Basis!$F$8,0,(BK9-Basis!$F$8)*0.4))","v":45.6},{"$f":"IF(N9=\"\",\"\",IF(BK9>Basis!$G$8,0,(Basis!$G$8-BK9)*0.4))","v":0},45.6,null,21,21.5,7,7.166666666666667]
[null,null,125,null,"Heleen van Pol","Winning Boy P Z","RV. Trouwe Kameraden",null,150,{"$f":"IF(I10=\"\",\"\",IF(ISTEXT(I10),I10,IF(I10<=Basis!$M$8,\"Uit\",(100-(I10/Basis!$L$8*100))*Basis!$Y$6)))","v":50},12,42,"Uit",12,56,{"$f":"IF(N10=\"\",\"\",IF(N10*60+O10>Basis!$U$8,\"Uit\",BL10+BM10))","v":"Uit"},null,"Uit",6.666666666666667,6.333333333333333,"Uit","4W h.5 d*",null,125,0,"-","-",20,"3W",60,"-","-","-","-",20,"-",11,"-","-",null,null,null,null,null,null,null,null,null,null,"Uit","4W h.5 d*",null,125,null,"15:12:00","15:24:56","00:12:56",12,56,null,{"$f":"IF(K10=\"\",\"\",IF(ISTEXT(K10),K10,IF(K10>Basis!$N$8,\"Uit\",IF(ISBLANK(L10),K10,K10+L10))))","v":54},104,776,{"$f":"IF(N10=\"\",\"\",IF(BK10<=Basis!$F$8,0,(BK10-Basis!$F$8)*0.4))","v":222.4},{"$f":"IF(N10=\"\",\"\",IF(BK10>Basis!$G$8,0,(Basis!$G$8-BK10)*0.4))","v":0},"Uit",null,20,19,6.666666666666667,6.333333333333333]
[null,null,126,null,"Heather Huijers","Gloriant","RV. Maresca Ruiters",null,150,{"$f":"IF(I11=\"\",\"\",IF(ISTEXT(I11),I11,IF(I11<=Basis!$M$8,\"Uit\",(100-(I11/Basis!$L$8*100))*Basis!$Y$6)))","v":50},12,16,"Uit",5,54,{"$f":"IF(N11=\"\",\"\",IF(N11*60+O11>Basis!$U$8,\"Uit\",BL11+BM11))","v":53.6},null,"Uit",5.833333333333333,6.833333333333333,"Uit","4W h.10 d*",null,126,0,"-",20,"-",20,"-","-","-","-",20,"-",20,"-","-","-",null,null,null,null,null,null,null,null,null,null,"Uit","4W h.10 d*",null,126,null,"15:14:00","15:19:54","00:05:54",5,54,null,{"$f":"IF(K11=\"\",\"\",IF(ISTEXT(K11),K11,IF(K11>Basis!$N$8,\"Uit\",IF(ISBLANK(L11),K11,K11+L11))))","v":28},78,354,{"$f":"IF(N11=\"\",\"\",IF(BK11<=Basis!$F$8,0,(BK11-Basis!$F$8)*0.4))","v":53.6},{"$f":"IF(N11=\"\",\"\",IF(BK11>Basis!$G$8,0,(Basis!$G$8-BK11)*0.4))","v":0},"Uit",null,17.5,20.5,5.833333333333333,6.833333333333333]
[null,null,127,null,"Nadja Olberts","Habibi","RV. Voerendaal",null,150,{"$f":"IF(I12=\"\",\"\",IF(ISTEXT(I12),I12,IF(I12<=Basis!$M$8,\"Uit\",(100-(I12/Basis!$L$8*100))*Basis!$Y$6)))","v":50},0,6,"Uit",8,50,{"$f":"IF(N12=\"\",\"\",IF(N12*60+O12>Basis!$U$8,\"Uit\",BL12+BM12))","v":"Uit"},null,"Uit",5.666666666666667,6.666666666666667,"Uit","4W h.8 d*",null,127,20,"-",60,"-","-","-","-","-","-",20,"-",20,"-","-","-",null,null,null,null,null,null,null,null,null,null,"Uit","4W h.8 d*",null,127,null,"15:16:00","15:24:50","00:08:50",8,50,null,{"$f":"IF(K12=\"\",\"\",IF(ISTEXT(K12),K12,IF(K12>Basis!$N$8,\"Uit\",IF(ISBLANK(L12),K12,K12+L12))))","v":6},56,530,{"$f":"IF(N12=\"\",\"\",IF(BK12<=Basis!$F$8,0,(BK12-Basis!$F$8)*0.4))","v":124},{"$f":"IF(N12=\"\",\"\",IF(BK12>Basis!$G$8,0,(Basis!$G$8-BK12)*0.4))","v":0},"Uit",null,17,20,5.666666666666667,6.666666666666667]
[null,null,129,null,"Sofie Schobre","Sinvest Wolverine",null,null,150,{"$f":"IF(I13=\"\",\"\",IF(ISTEXT(I13),I13,IF(I13<=Basis!$M$8,\"Uit\",(100-(I13/Basis!$L$8*100))*Basis!$Y$6)))","v":50},8,0,"Uit",8,27,{"$f":"IF(N13=\"\",\"\",IF(N13*60+O13>Basis!$U$8,\"Uit\",BL13+BM13))","v":"Uit"},null,"Uit",6.333333333333333,7,"Uit","4W h.5 d*",null,129,20,"-","-",60,20,20,"-","-","-","-","3W","-","-","-","-",null,null,null,null,null,null,null,null,null,null,"Uit","4W h.5 d*",null,129,null,"15:20:00","15:28:27","00:08:27",8,27,null,{"$f":"IF(K13=\"\",\"\",IF(ISTEXT(K13),K13,IF(K13>Basis!$N$8,\"Uit\",IF(ISBLANK(L13),K13,K13+L13))))","v":8},58,507,{"$f":"IF(N13=\"\",\"\",IF(BK13<=Basis!$F$8,0,(BK13-Basis!$F$8)*0.4))","v":114.80000000000001},{"$f":"IF(N13=\"\",\"\",IF(BK13>Basis!$G$8,0,(Basis!$G$8-BK13)*0.4))","v":0},"Uit",null,19,21,6.333333333333333,7]
[null,null,130,null,"Yvette Waumans","Gavi","RV. Pegasus",null,150,{"$f":"IF(I14=\"\",\"\",IF(ISTEXT(I14),I14,IF(I14<=Basis!$M$8,\"Uit\",(100-(I14/Basis!$L$8*100))*Basis!$Y$6)))","v":50},0,0,"Uit",9,42,{"$f":"IF(N14=\"\",\"\",IF(N14*60+O14>Basis!$U$8,\"Uit\",BL14+BM14))","v":"Uit"},null,"Uit",5.5,7,"Uit","4W h.9 d*",null,130,60,"-",20,"-","-","-","-","-","-","-",20,"-","-","-","-",null,null,null,null,null,null,null,null,null,null,"Uit","4W h.9 d*",null,130,null,"15:22:00","15:31:42","00:09:42",9,42,null,{"$f":"IF(K14=\"\",\"\",IF(ISTEXT(K14),K14,IF(K14>Basis!$N$8,\"Uit\",IF(ISBLANK(L14),K14,K14+L14))))","v":0},50,582,{"$f":"IF(N14=\"\",\"\",IF(BK14<=Basis!$F$8,0,(BK14-Basis!$F$8)*0.4))","v":144.80000000000001},{"$f":"IF(N14=\"\",\"\",IF(BK14>Basis!$G$8,0,(Basis!$G$8-BK14)*0.4))","v":0},"Uit",null,16.5,21,5.5,7]
[null,null,132,null,"Frederique Brouwers","Blue Velvet","RV. Fevior (r.s.v.)",null,150,{"$f":"IF(I15=\"\",\"\",IF(ISTEXT(I15),I15,IF(I15<=Basis!$M$8,\"Uit\",(100-(I15/Basis!$L$8*100))*Basis!$Y$6)))","v":50},0,0,"Uit",6,10,{"$f":"IF(N15=\"\",\"\",IF(N15*60+O15>Basis!$U$8,\"Uit\",BL15+BM15))","v":60},null,"Uit",6.666666666666667,6.5,"Uit","FP VD h.7 d*",null,132,0,"-","-","-","-","-","-","-","FP",20,"-",20,"FP","-","-",null,null,null,null,null,null,null,null,null,null,"Uit","FP VD h.7 d*",null,132,null,"15:26:00","15:32:10","00:06:10",6,10,null,{"$f":"IF(K15=\"\",\"\",IF(ISTEXT(K15),K15,IF(K15>Basis!$N$8,\"Uit\",IF(ISBLANK(L15),K15,K15+L15))))","v":0},50,370,{"$f":"IF(N15=\"\",\"\",IF(BK15<=Basis!$F$8,0,(BK15-Basis!$F$8)*0.4))","v":60},{"$f":"IF(N15=\"\",\"\",IF(BK15>Basis!$G$8,0,(Basis!$G$8-BK15)*0.4))","v":0},"Uit",null,20,19.5,6.666666666666667,6.5]
[null,null,122,null,"Vincent Erkamp","Ivan","Manege De Hoef V.O.F.",null,150,{"$f":"IF(I16=\"\",\"\",IF(ISTEXT(I16),I16,IF(I16<=Basis!$M$8,\"Uit\",(100-(I16/Basis!$L$8*100))*Basis!$Y$6)))","v":50},"NG",null,"NG","","",{"$f":"IF(N16=\"\",\"\",IF(N16*60+O16>Basis!$U$8,\"Uit\",BL16+BM16))","v":""},null,"NG","","","NG","",null,122,"NG","-","-","-","-","-","-","-","-","-","-","-","-","-","-",null,null,null,null,null,null,null,null,null,null,{"$f":"IF(Y16=\"\",\"\",IF(ISTEXT(Y16),Y16,SUM(Y16:AW16)))","v":"NG"},null,null,122,null,"15:06:00",null,"","","",null,{"$f":"IF(K16=\"\",\"\",IF(ISTEXT(K16),K16,IF(K16>Basis!$N$8,\"Uit\",IF(ISBLANK(L16),K16,K16+L16))))","v":"NG"},"NG","",{"$f":"IF(N16=\"\",\"\",IF(BK16<=Basis!$F$8,0,(BK16-Basis!$F$8)*0.4))","v":""},{"$f":"IF(N16=\"\",\"\",IF(BK16>Basis!$G$8,0,(Basis!$G$8-BK16)*0.4))","v":""},"NG",null,null,null,"",""]
[null,null,123,null,null,null,null,null,150,{"$f":"IF(I17=\"\",\"\",IF(ISTEXT(I17),I17,IF(I17<=Basis!$M$8,\"Uit\",(100-(I17/Basis!$L$8*100))*Basis!$Y$6)))","v":50},"NG",null,"NG","","",{"$f":"IF(N17=\"\",\"\",IF(N17*60+O17>Basis!$U$8,\"Uit\",BL17+BM17))","v":""},null,"NG","","","NG","",null,123,"NG","-","-","-","-","-","-","-","-","-","-","-","-","-","-",null,null,null,null,null,null,null,null,null,null,{"$f":"IF(Y17=\"\",\"\",IF(ISTEXT(Y17),Y17,SUM(Y17:AW17)))","v":"NG"},null,null,123,null,"15:08:00",null,"","","",null,{"$f":"IF(K17=\"\",\"\",IF(ISTEXT(K17),K17,IF(K17>Basis!$N$8,\"Uit\",IF(ISBLANK(L17),K17,K17+L17))))","v":"NG"},"NG","",{"$f":"IF(N17=\"\",\"\",IF(BK17<=Basis!$F$8,0,(BK17-Basis!$F$8)*0.4))","v":""},{"$f":"IF(N17=\"\",\"\",IF(BK17>Basis!$G$8,0,(Basis!$G$8-BK17)*0.4))","v":""},"NG",null,null,null,"",""]
[null,null,128,null,"Janneke Siepman","Glanmire Rosie","RV. Prins Maurits",null,150,{"$f":"IF(I18=\"\",\"\",IF(ISTEXT(I18),I18,IF(I18<=Basis!$M$8,\"Uit\",(100-(I18/Basis!$L$8*100))*Basis!$Y$6)))","v":50},"NG",null,"NG",9,39,{"$f":"IF(N18=\"\",\"\",IF(N18*60+O18>Basis!$U$8,\"Uit\",BL18+BM18))","v":"Uit"},null,"NG","","","NG","",null,128,"NG","-","-","-","-","-","-","-","-","-","-","-","-","-","-",null,null,null,null,null,null,null,null,null,null,{"$f":"IF(Y18=\"\",\"\",IF(ISTEXT(Y18),Y18,SUM(Y18:AW18)))","v":"NG"},null,null,128,null,"15:18:00","15:27:39","00:09:39",9,39,null,{"$f":"IF(K18=\"\",\"\",IF(ISTEXT(K18),K18,IF(K18>Basis!$N$8,\"Uit\",IF(ISBLANK(L18),K18,K18+L18))))","v":"NG"},"NG",579,{"$f":"IF(N18=\"\",\"\",IF(BK18<=Basis!$F$8,0,(BK18-Basis!$F$8)*0.4))","v":143.6},{"$f":"IF(N18=\"\",\"\",IF(BK18>Basis!$G$8,0,(Basis!$G$8-BK18)*0.4))","v":0},"NG",null,null,null,"",""]
[null,null,134,null,"Tessa van Ewijk","Torenta hc",null,null,150,{"$f":"IF(I19=\"\",\"\",IF(ISTEXT(I19),I19,IF(I19<=Basis!$M$8,\"Uit\",(100-(I19/Basis!$L$8*100))*Basis!$Y$6)))","v":50},"NG",null,"NG","","",{"$f":"IF(N19=\"\",\"\",IF(N19*60+O19>Basis!$U$8,\"Uit\",BL19+BM19))","v":""},null,"NG","","","NG","",null,134,"NG","-","-","-","-","-","-","-","-","-","-","-","-","-","-",null,null,null,null,null,null,null,null,null,null,{"$f":"IF(Y19=\"\",\"\",IF(ISTEXT(Y19),Y19,SUM(Y19:AW19)))","v":"NG"},null,null,134,null,"15:30:00",null,"","","",null,{"$f":"IF(K19=\"\",\"\",IF(ISTEXT(K19),K19,IF(K19>Basis!$N$8,\"Uit\",IF(ISBLANK(L19),K19,K19+L19))))","v":"NG"},"NG","",{"$f":"IF(N19=\"\",\"\",IF(BK19<=Basis!$F$8,0,(BK19-Basis!$F$8)*0.4))","v":""},{"$f":"IF(N19=\"\",\"\",IF(BK19>Basis!$G$8,0,(Basis!$G$8-BK19)*0.4))","v":""},"NG",null,null,null,"",""]
[null,null,null,null,null,null,null,null,null,{"$f":"IF(I20=\"\",\"\",IF(ISTEXT(I20),I20,IF(I20<=Basis!$M$8,\"Uit\",(100-(I20/Basis!$L$8*100))*Basis!$Y$6)))","v":""},null,null,{"$f":"IF(AX20=\"\",\"\",AX20)","v":""},{"$f":"IF(ISBLANK(BD20),\"\",BF20)","v":""},{"$f":"IF(ISBLANK(BD20),\"\",BG20)","v":""},{"$f":"IF(N20=\"\",\"\",IF(N20*60+O20>Basis!$U$8,\"Uit\",BL20+BM20))","v":""},null,{"$f":"IF(ISTEXT(BJ20),BJ20,IF(OR(ISBLANK(M20),M20=\"\",ISBLANK(Y20)),BJ20,IF(ISTEXT(BN20),BN20,BJ20+BN20)))","v":""},{"$f":"IF(BP20=\"\",\"\",BR20)","v":""},{"$f":"IF(BQ20=\"\",\"\",BS20)","v":""},{"$f":"IF(R20=\"\",\"\",IF(ISTEXT(R20),R20,IF(BP20=\"\",\"\",R20-S20-T20)))","v":""},{"$f":"IF(AY20=\"\",\"\",AY20)","v":""},null,{"$f":"IF($C20=\"\",\"\",$C20)","v":""},null,null,null,null,null,null,null,null,null,null,null,null,null,null,null,null,null,null,null,null,null,null,null,null,null,{"$f":"IF(Y20=\"\",\"\",IF(ISTEXT(Y20),Y20,SUM(Y20:AW20)))","v":""},null,null,{"$f":"IF($C20=\"\",\"\",$C20)","v":""},null,null,null,{"$f":"IF(ISBLANK(BD20),\"\",BD20-BC20)","v":""},{"$f":"IF(ISBLANK(BD20),\"\",MINUTE(BE20))","v":""},{"$f":"IF(ISBLANK(BD20),\"\",SECOND(BE20))","v":""},null,{"$f":"IF(K20=\"\",\"\",IF(ISTEXT(K20),K20,IF(K20>Basis!$N$8,\"Uit\",IF(ISBLANK(L20),K20,K20+L20))))","v":""},{"$f":"IF(OR(ISTEXT(J20),BI20=\"\"),J20,IF(ISTEXT(BI20),BI20,J20+BI20))","v":""},{"$f":"IF(N20=\"\",\"\",N20*60+O20)","v":""},{"$f":"IF(N20=\"\",\"\",IF(BK20<=Basis!$F$8,0,(BK20-Basis!$F$8)*0.4))","v":""},{"$f":"IF(N20=\"\",\"\",IF(BK20>Basis!$G$8,0,(Basis!$G$8-BK20)*0.4))","v":""},{"$f":"IF(M20=\"\",\"\",IF(ISTEXT(M20),M20,IF(ISTEXT(P20),P20,M20+P20)))","v":""},null,null,null,{"$f":"IF(BP20=\"\",\"\",BP20/3)","v":""},{"$f":"IF(BQ20=\"\",\"\",BQ20/3)","v":""}]
[null,null,null,null,null,null,null,null,null,{"$f":"IF(I21=\"\",\"\",IF(ISTEXT(I21),I21,IF(I21<=Basis!$M$8,\"Uit\",(100-(I21/Basis!$L$8*100))*Basis!$Y$6)))","v":""},null,null,"","","",{"$f":"IF(N21=\"\",\"\",IF(N21*60+O21>Basis!$U$8,\"Uit\",BL21+BM21))","v":""},null,"","","","","",null,"",null,null,null,null,null,null,null,null,null,null,null,null,null,null,null,null,null,null,null,null,null,null,null,null,null,"",null,null,"",null,null,null,"","","",null,{"$f":"IF(K21=\"\",\"\",IF(ISTEXT(K21),K21,IF(K21>Basis!$N$8,\"Uit\",IF(ISBLANK(L21),K21,K21+L21))))","v":""},"","",{"$f":"IF(N21=\"\",\"\",IF(BK21<=Basis!$F$8,0,(BK21-Basis!$F$8)*0.4))","v":""},{"$f":"IF(N21=\"\",\"\",IF(BK21>Basis!$G$8,0,(Basis!$G$8-BK21)*0.4))","v":""},"",null,null,null,"",""]
[null,null,null,null,null,null,null,null,null,{"$f":"IF(I22=\"\",\"\",IF(ISTEXT(I22),I22,IF(I22<=Basis!$M$8,\"Uit\",(100-(I22/Basis!$L$8*100))*Basis!$Y$6)))","v":""},null,null,"","","",{"$f":"IF(N22=\"\",\"\",IF(N22*60+O22>Basis!$U$8,\"Uit\",BL22+BM22))","v":""},null,"","","","","",null,"",null,null,null,null,null,null,null,null,null,null,null,null,null,null,null,null,null,null,null,null,null,null,null,null,null,"",null,null,"",null,null,null,"","","",null,{"$f":"IF(K22=\"\",\"\",IF(ISTEXT(K22),K22,IF(K22>Basis!$N$8,\"Uit\",IF(ISBLANK(L22),K22,K22+L22))))","v":""},"","",{"$f":"IF(N22=\"\",\"\",IF(BK22<=Basis!$F$8,0,(BK22-Basis!$F$8)*0.4))","v":""},{"$f":"IF(N22=\"\",\"\",IF(BK22>Basis!$G$8,0,(Basis!$G$8-BK22)*0.4))","v":""},"",null,null,null,"",""]
[null,null,null,null,null,null,null,null,null,{"$f":"IF(I23=\"\",\"\",IF(ISTEXT(I23),I23,IF(I23<=Basis!$M$8,\"Uit\",(100-(I23/Basis!$L$8*100))*Basis!$Y$6)))","v":""},null,null,"","","",{"$f":"IF(N23=\"\",\"\",IF(N23*60+O23>Basis!$U$8,\"Uit\",BL23+BM23))","v":""},null,"","","","","",null,"",null,null,null,null,null,null,null,null,null,null,null,null,null,null,null,null,null,null,null,null,null,null,null,null,null,"",null,null,"",null,null,null,"","","",null,{"$f":"IF(K23=\"\",\"\",IF(ISTEXT(K23),K23,IF(K23>Basis!$N$8,\"Uit\",IF(ISBLANK(L23),K23,K23+L23))))","v":""},"","",{"$f":"IF(N23=\"\",\"\",IF(BK23<=Basis!$F$8,0,(BK23-Basis!$F$8)*0.4))","v":""},{"$f":"IF(N23=\"\",\"\",IF(BK23>Basis!$G$8,0,(Basis!$G$8-BK23)*0.4))","v":""},"",null,null,null,"",""]
[null,null,null,null,null,null,null,null,null,{"$f":"IF(I24=\"\",\"\",IF(ISTEXT(I24),I24,IF(I24<=Basis!$M$8,\"Uit\",(100-(I24/Basis!$L$8*100))*Basis!$Y$6)))","v":""},null,null,{"$f":"IF(AX24=\"\",\"\",AX24)","v":""},{"$f":"IF(ISBLANK(BD24),\"\",BF24)","v":""},{"$f":"IF(ISBLANK(BD24),\"\",BG24)","v":""},{"$f":"IF(N24=\"\",\"\",IF(N24*60+O24>Basis!$U$8,\"Uit\",BL24+BM24))","v":""},null,{"$f":"IF(ISTEXT(BJ24),BJ24,IF(OR(ISBLANK(M24),M24=\"\",ISBLANK(Y24)),BJ24,IF(ISTEXT(BN24),BN24,BJ24+BN24)))","v":""},{"$f":"IF(BP24=\"\",\"\",BR24)","v":""},"",{"$f":"IF(R24=\"\",\"\",IF(ISTEXT(R24),R24,IF(BP24=\"\",\"\",R24-S24-T24)))","v":""},{"$f":"IF(AY24=\"\",\"\",AY24)","v":""},null,{"$f":"IF($C24=\"\",\"\",$C24)","v":""},null,null,null,null,null,null,null,null,null,null,null,null,null,null,null,null,null,null,null,null,null,null,null,null,null,{"$f":"IF(Y24=\"\",\"\",IF(ISTEXT(Y24),Y24,SUM(Y24:AW24)))","v":""},null,null,{"$f":"IF($C24=\"\",\"\",$C24)","v":""},null,null,null,{"$f":"IF(ISBLANK(BD24),\"\",BD24-BC24)","v":""},{"$f":"IF(ISBLANK(BD24),\"\",MINUTE(BE24))","v":""},{"$f":"IF(ISBLANK(BD24),\"\",SECOND(BE24))","v":""},null,{"$f":"IF(K24=\"\",\"\",IF(ISTEXT(K24),K24,IF(K24>Basis!$N$8,\"Uit\",IF(ISBLANK(L24),K24,K24+L24))))","v":""},{"$f":"IF(OR(ISTEXT(J24),BI24=\"\"),J24,IF(ISTEXT(BI24),BI24,J24+BI24))","v":""},{"$f":"IF(N24=\"\",\"\",N24*60+O24)","v":""},{"$f":"IF(N24=\"\",\"\",IF(BK24<=Basis!$F$8,0,(BK24-Basis!$F$8)*0.4))","v":""},{"$f":"IF(N24=\"\",\"\",IF(BK24>Basis!$G$8,0,(Basis!$G$8-BK24)*0.4))","v":""},{"$f":"IF(M24=\"\",\"\",IF(ISTEXT(M24),M24,IF(ISTEXT(P24),P24,M24+P24)))","v":""},null,null,null,{"$f":"IF(BP24=\"\",\"\",BP24/3)","v":""},""]
["  Bij uitsluiting reden vermelden : ",null,null,null,null,null,null,null,null,null,null,null,null,null,null,{"$f":"NOW()","v":"2018-06-30T22:02:24.880"},null,null,null,null,null,null,null,{"$f":"A25","v":"  Bij uitsluiting reden vermelden : "},null,null,null,null,null,null,null,null,null,null,null,null,null,null,null,null,null,null,null,null,null,null,{"$f":"NOW()","v":"2018-06-30T22:02:24.880"}]
["  VP=val paard, VR=val ruiter, 3W=3 weigeringen op zelfde hindernis, 4W=4 weigeringen totaal, FP=foutief parcours, Vr.v= vrijwillig verlaten",null,null,null,null,null,null,null,null,null,null,null,null,null,null,null,null,null,null,null,null,null,null,{"$f":"A26","v":"  VP=val paard, VR=val ruiter, 3W=3 weigeringen op zelfde hindernis, 4W=4 weigeringen totaal, FP=foutief parcours, Vr.v= vrijwillig verlaten"}]

{"sheet":"Ring 4 - B-CD","index":16,"n_rows":24,"n_cols":71,"rows_kept":24,"cut":false,"hidden":false,"merged":[[2,13,2,14],[22,15,22,21],[22,46,22,52]]}
[{"$f":"\" Samengestelde wedstrijd \"&Basis!D18","v":" Samengestelde wedstrijd Eventing Leende 30 juni 2018"},null,null,null,null,null,"Klasse B - Cat CD - Ring 4",null,null,null,null,"Dressuurjury : ","Anita Feije",null,null,null,null,null,null,null,null,null,null," Verzamelstaat hindernisfouten in de cross",null,null,null,null,null,null,null,null,null,null,null,null,{"$f":"A1","v":" Samengestelde wedstrijd Eventing Leende 30 juni 2018"},null,null,null,null,null,null,null,null,null,null,null,null,null,null,null,{"$f":"G1&\" \"","v":"Klasse B - Cat CD - Ring 4 "},null," Indien aankomstUUR cross wordt meegedeeld :",null,null,null,null,null," Hulpkolommen",null,null,null,null,null,null," Stijlcijfers :"]
["rank","pony","rugnr","combinatie nr","naam ruiter","naam pony","vereniging / plaats",null,"dressuur","dressuur","hind.ft.","tijd.ft.","hind.ft.","min","sec","tijd.ft.",null,"totaal","(1) stijl","(2) stijl","eind-","reden",null,null,"hindernisnummer",null,null,null,null,null,null,null,null,null,null,null,null,null,null,null,null,null,null,null,null,null,null,null,null,null," ",null,null,null,null,null,null,null,null,null,"Uitslag","NA","tijd (sec)","tijd.ft.","reg.ft.","totaal",null,"Totaal","Totaal","Gemiddelde","Gemiddelde"]
["HC","cat.",null,null,null,null,null,null,"totaal","strafpntn.","springen","springen","cross","cross",null,{"$f":"Basis!$H$22&\":\"&TEXT(Basis!$I$22,\"00\")","v":"3:42"},null,null,"cijfer","cijfer","totaal","uitsluiting",null,"nr",1,2,3,4,5,6,"VD",7,"VD","8ab",9,"10ab",11,12,"F",null,null,null,null,null,null,null,null,null,null,"totaal","reden uitsluiting","hind.","nr",null,"Vertrekuur","Aankomst","Tijd","Minuten","Seconden",null,"Springen","Springen","cross","opt.tijd =",{"$f":"Basis!$H$22&\":\"&TEXT(Basis!$I$22,\"00\")","v":"3:42"},"cross",null,"Jury 1","Jury 2","Jury 1","Jury 2"]
[null,null,null,null,null,null,null,null,null,null,null,null,null,null,null,null,null,{"$f":"IF(ISBLANK(I4),\"\",IF(AND(ISBLANK(K4),ISBLANK(Y4)),J4,IF(ISTEXT(K4),K4,IF(OR(ISBLANK(M4),M4=\"\"),J4+K4+L4,IF(ISTEXT(M4),M4,IF(ISBLANK(Y4),J4+K4+L4,J4+K4+L4+M4+P4+Q4))))))","v":""}]
[1,"D",138,"800947KJ","Margje Janssen","Kosmo's Badboy","PC. Rijdt Met Beleid",null,231.5,{"$f":"IF(I5=\"\",\"\",IF(ISTEXT(I5),I5,IF(I5<=Basis!$M$22,\"Uit\",(100-(I5/Basis!$L$22*100))*Basis!$Y$19)))","v":22.833333333333343},0,0,{"$f":"IF(AX5=\"\",\"\",AX5)","v":0},{"$f":"IF(ISBLANK(BD5),\"\",BF5)","v":3},{"$f":"IF(ISBLANK(BD5),\"\",BG5)","v":57},{"$f":"IF(N5=\"\",\"\",IF(N5*60+O5>Basis!$U$22,\"Uit\",BL5+BM5))","v":6},null,{"$f":"IF(ISTEXT(BJ5),BJ5,IF(OR(ISBLANK(M5),M5=\"\",ISBLANK(Y5)),BJ5,IF(ISTEXT(BN5),BN5,BJ5+BN5)))","v":28.833333333333343},{"$f":"IF(BP5=\"\",\"\",BR5)","v":6.5},{"$f":"IF(BQ5=\"\",\"\",BS5)","v":7.166666666666667},{"$f":"IF(R5=\"\",\"\",IF(ISTEXT(R5),R5,IF(BP5=\"\",\"\",R5-S5-T5)))","v":15.166666666666675},{"$f":"IF(AY5=\"\",\"\",AY5)","v":""},null,{"$f":"IF($C5=\"\",\"\",$C5)","v":138},0,"-","-","-","-","-","-","-","-","-","-","-","-","-","-",null,null,null,null,null,null,null,null,null,null,{"$f":"IF(Y5=\"\",\"\",IF(ISTEXT(Y5),Y5,SUM(Y5:AW5)))","v":0},null,null,{"$f":"IF($C5=\"\",\"\",$C5)","v":138},null,"15:38:00","15:41:57",{"$f":"IF(ISBLANK(BD5),\"\",BD5-BC5)","v":"00:03:57"},{"$f":"IF(ISBLANK(BD5),\"\",MINUTE(BE5))","v":3},{"$f":"IF(ISBLANK(BD5),\"\",SECOND(BE5))","v":57},null,{"$f":"IF(K5=\"\",\"\",IF(ISTEXT(K5),K5,IF(K5>Basis!$N$22,\"Uit\",IF(ISBLANK(L5),K5,K5+L5))))","v":0},{"$f":"IF(OR(ISTEXT(J5),BI5=\"\"),J5,IF(ISTEXT(BI5),BI5,J5+BI5))","v":22.833333333333343},{"$f":"IF(N5=\"\",\"\",N5*60+O5)","v":237},{"$f":"IF(N5=\"\",\"\",IF(BK5<=Basis!$F$22,0,(BK5-Basis!$F$22)*0.4))","v":6},{"$f":"IF(N5=\"\",\"\",IF(BK5>Basis!$G$22,0,(Basis!$G$22-BK5)*0.4))","v":0},{"$f":"IF(M5=\"\",\"\",IF(ISTEXT(M5),M5,IF(ISTEXT(P5),P5,M5+P5)))","v":6},null,19.5,21.5,{"$f":"IF(BP5=\"\",\"\",BP5/3)","v":6.5},{"$f":"IF(BQ5=\"\",\"\",BQ5/3)","v":7.166666666666667}]
[2,"D",143,"774782PR","Annika Renkens","Pearl","PC. De Musketiers",null,198,{"$f":"IF(I6=\"\",\"\",IF(ISTEXT(I6),I6,IF(I6<=Basis!$M$22,\"Uit\",(100-(I6/Basis!$L$22*100))*Basis!$Y$19)))","v":34},0,0,0,4,0,{"$f":"IF(N6=\"\",\"\",IF(N6*60+O6>Basis!$U$22,\"Uit\",BL6+BM6))","v":7.2},null,41.2,8,7.333333333333333,25.866666666666671,"",null,143,0,"-","-","-","-","-","-","-","-","-","-","-","-","-","-",null,null,null,null,null,null,null,null,null,null,0,null,null,143,null,"15:48:00","15:52:00","00:04:00",4,0,null,{"$f":"IF(K6=\"\",\"\",IF(ISTEXT(K6),K6,IF(K6>Basis!$N$22,\"Uit\",IF(ISBLANK(L6),K6,K6+L6))))","v":0},34,240,{"$f":"IF(N6=\"\",\"\",IF(BK6<=Basis!$F$22,0,(BK6-Basis!$F$22)*0.4))","v":7.2},{"$f":"IF(N6=\"\",\"\",IF(BK6>Basis!$G$22,0,(Basis!$G$22-BK6)*0.4))","v":0},7.2,null,24,22,8,7.333333333333333]
[3,"C",148,"845806KG","Serlina van Gelder","Kyra's Promising Hidden Treas","PC. Sint Anthonis (Saxe Gotha)",null,193,{"$f":"IF(I7=\"\",\"\",IF(ISTEXT(I7),I7,IF(I7<=Basis!$M$21,\"Uit\",(100-(I7/Basis!$L$21*100))*Basis!$Y$19)))","v":35.666666666666671},0,0,0,4,13,{"$f":"IF(N7=\"\",\"\",IF(N7*60+O7>Basis!$U$21,\"Uit\",BL7+BM7))","v":10.4},null,46.06666666666667,8.5,6.666666666666667,30.900000000000002,"",null,148,0,"-","-","-","-","-","-","-","-","-","-","-","-","-","-",null,null,null,null,null,null,null,null,null,null,0,null,null,148,null,"15:59:00","16:03:13","00:04:13",4,13,null,{"$f":"IF(K7=\"\",\"\",IF(ISTEXT(K7),K7,IF(K7>Basis!$N$21,\"Uit\",IF(ISBLANK(L7),K7,K7+L7))))","v":0},35.666666666666671,253,{"$f":"IF(N7=\"\",\"\",IF(BK7<=Basis!$F$21,0,(BK7-Basis!$F$21)*0.4))","v":10.4},{"$f":"IF(N7=\"\",\"\",IF(BK7>Basis!$G$21,0,(Basis!$G$21-BK7)*0.4))","v":0},10.4,null,25.5,20,8.5,6.666666666666667]
[4,"D",140,"831886SH","Luc Hakkesteegt","Stan de Man","PC. Beyaert",null,190,{"$f":"IF(I8=\"\",\"\",IF(ISTEXT(I8),I8,IF(I8<=Basis!$M$22,\"Uit\",(100-(I8/Basis!$L$22*100))*Basis!$Y$19)))","v":36.666666666666671},0,0,0,4,5,{"$f":"IF(N8=\"\",\"\",IF(N8*60+O8>Basis!$U$22,\"Uit\",BL8+BM8))","v":9.2000000000000011},null,45.866666666666674,6.833333333333333,7,32.033333333333339,"",null,140,0,"-","-","-","-","-","-","-","-","-","-","-","-","-","-",null,null,null,null,null,null,null,null,null,null,0,null,null,140,null,"15:42:00","15:46:05","00:04:05",4,5,null,{"$f":"IF(K8=\"\",\"\",IF(ISTEXT(K8),K8,IF(K8>Basis!$N$22,\"Uit\",IF(ISBLANK(L8),K8,K8+L8))))","v":0},36.666666666666671,245,{"$f":"IF(N8=\"\",\"\",IF(BK8<=Basis!$F$22,0,(BK8-Basis!$F$22)*0.4))","v":9.2000000000000011},{"$f":"IF(N8=\"\",\"\",IF(BK8>Basis!$G$22,0,(Basis!$G$22-BK8)*0.4))","v":0},9.2000000000000011,null,20.5,21,6.833333333333333,7]
[5,"D",137,"758467DS","Noa Sporenberg","Dreamgirl","PC. De Reigertjes",null,214.5,{"$f":"IF(I9=\"\",\"\",IF(ISTEXT(I9),I9,IF(I9<=Basis!$M$22,\"Uit\",(100-(I9/Basis!$L$22*100))*Basis!$Y$19)))","v":28.5},4,0,0,4,23,{"$f":"IF(N9=\"\",\"\",IF(N9*60+O9>Basis!$U$22,\"Uit\",BL9+BM9))","v":16.400000000000002},null,48.900000000000006,7.333333333333333,7.666666666666667,33.900000000000006,"",null,137,0,"-","-","-","-","-","-","-","-","-","-","-","-","-","-",null,null,null,null,null,null,null,null,null,null,0,null,null,137,null,"15:36:00","15:40:23","00:04:23",4,23,null,{"$f":"IF(K9=\"\",\"\",IF(ISTEXT(K9),K9,IF(K9>Basis!$N$22,\"Uit\",IF(ISBLANK(L9),K9,K9+L9))))","v":4},32.5,263,{"$f":"IF(N9=\"\",\"\",IF(BK9<=Basis!$F$22,0,(BK9-Basis!$F$22)*0.4))","v":16.400000000000002},{"$f":"IF(N9=\"\",\"\",IF(BK9>Basis!$G$22,0,(Basis!$G$22-BK9)*0.4))","v":0},16.400000000000002,null,22,23,7.333333333333333,7.666666666666667]
[6,"D",144,"799738EP","Femke Plass","Eikenhorst’s Messi",null,null,206,{"$f":"IF(I10=\"\",\"\",IF(ISTEXT(I10),I10,IF(I10<=Basis!$M$22,\"Uit\",(100-(I10/Basis!$L$22*100))*Basis!$Y$19)))","v":31.333333333333329},0,0,0,4,48,{"$f":"IF(N10=\"\",\"\",IF(N10*60+O10>Basis!$U$22,\"Uit\",BL10+BM10))","v":26.400000000000002},null,57.733333333333334,7.833333333333333,7.333333333333333,42.566666666666663,"",null,144,0,"-","-","-","-","-","-","-","-","-","-","-","-","-","-",null,null,null,null,null,null,null,null,null,null,0,null,null,144,null,"15:50:00","15:54:48","00:04:48",4,48,null,{"$f":"IF(K10=\"\",\"\",IF(ISTEXT(K10),K10,IF(K10>Basis!$N$22,\"Uit\",IF(ISBLANK(L10),K10,K10+L10))))","v":0},31.333333333333329,288,{"$f":"IF(N10=\"\",\"\",IF(BK10<=Basis!$F$22,0,(BK10-Basis!$F$22)*0.4))","v":26.400000000000002},{"$f":"IF(N10=\"\",\"\",IF(BK10>Basis!$G$22,0,(Basis!$G$22-BK10)*0.4))","v":0},26.400000000000002,null,23.5,22,7.833333333333333,7.333333333333333]
[7,"D",141,"853142MS","Esmee van der Sterren","Magic Roses Cocktail ","PC. St. Jan Merselo",null,179.5,{"$f":"IF(I11=\"\",\"\",IF(ISTEXT(I11),I11,IF(I11<=Basis!$M$22,\"Uit\",(100-(I11/Basis!$L$22*100))*Basis!$Y$19)))","v":40.166666666666664},0,0,0,4,29,{"$f":"IF(N11=\"\",\"\",IF(N11*60+O11>Basis!$U$22,\"Uit\",BL11+BM11))","v":18.8},null,58.966666666666669,6.833333333333333,7.5,44.633333333333333,"",null,141,0,"-","-","-","-","-","-","-","-","-","-","-","-","-","-",null,null,null,null,null,null,null,null,null,null,0,null,null,141,null,"15:44:00","15:48:29","00:04:29",4,29,null,{"$f":"IF(K11=\"\",\"\",IF(ISTEXT(K11),K11,IF(K11>Basis!$N$22,\"Uit\",IF(ISBLANK(L11),K11,K11+L11))))","v":0},40.166666666666664,269,{"$f":"IF(N11=\"\",\"\",IF(BK11<=Basis!$F$22,0,(BK11-Basis!$F$22)*0.4))","v":18.8},{"$f":"IF(N11=\"\",\"\",IF(BK11>Basis!$G$22,0,(Basis!$G$22-BK11)*0.4))","v":0},18.8,null,20.5,22.5,6.833333333333333,7.5]
[8,"D",139,"829737CB","Stijn van Bokhoven","Coshla Bill","PC. Het Edele Ros",null,189,{"$f":"IF(I12=\"\",\"\",IF(ISTEXT(I12),I12,IF(I12<=Basis!$M$22,\"Uit\",(100-(I12/Basis!$L$22*100))*Basis!$Y$19)))","v":37},0,0,20,5,8,{"$f":"IF(N12=\"\",\"\",IF(N12*60+O12>Basis!$U$22,\"Uit\",BL12+BM12))","v":34.4},null,91.4,7.166666666666667,7.333333333333333,76.900000000000006,"",null,139,0,"-",20,"-","-","-","-","-","-","-","-","-","-","-","-",null,null,null,null,null,null,null,null,null,null,20,null,null,139,null,"15:40:00","15:45:08","00:05:08",5,8,null,{"$f":"IF(K12=\"\",\"\",IF(ISTEXT(K12),K12,IF(K12>Basis!$N$22,\"Uit\",IF(ISBLANK(L12),K12,K12+L12))))","v":0},37,308,{"$f":"IF(N12=\"\",\"\",IF(BK12<=Basis!$F$22,0,(BK12-Basis!$F$22)*0.4))","v":34.4},{"$f":"IF(N12=\"\",\"\",IF(BK12>Basis!$G$22,0,(Basis!$G$22-BK12)*0.4))","v":0},54.4,null,21.5,22,7.166666666666667,7.333333333333333]
[9,"D",136,"777601RS","Nomi Steenbergen","Sterre","PC. Rynland",null,184,{"$f":"IF(I13=\"\",\"\",IF(ISTEXT(I13),I13,IF(I13<=Basis!$M$22,\"Uit\",(100-(I13/Basis!$L$22*100))*Basis!$Y$19)))","v":38.666666666666671},0,0,20,4,51,{"$f":"IF(N13=\"\",\"\",IF(N13*60+O13>Basis!$U$22,\"Uit\",BL13+BM13))","v":27.6},null,86.26666666666668,8,6.166666666666667,72.100000000000009,"",null,136,0,"-","-","-","-","-","-","-","-","-","-",20,"-","-","-",null,null,null,null,null,null,null,null,null,null,20,null,null,136,null,"15:34:00","15:38:51","00:04:51",4,51,null,{"$f":"IF(K13=\"\",\"\",IF(ISTEXT(K13),K13,IF(K13>Basis!$N$22,\"Uit\",IF(ISBLANK(L13),K13,K13+L13))))","v":0},38.666666666666671,291,{"$f":"IF(N13=\"\",\"\",IF(BK13<=Basis!$F$22,0,(BK13-Basis!$F$22)*0.4))","v":27.6},{"$f":"IF(N13=\"\",\"\",IF(BK13>Basis!$G$22,0,(Basis!$G$22-BK13)*0.4))","v":0},47.6,null,24,18.5,8,6.166666666666667]
[10,"D",147,"852021WB","Puck Buijnsters","Wielbraek's Fredje ","PC. De Cavalieren",null,193,{"$f":"IF(I14=\"\",\"\",IF(ISTEXT(I14),I14,IF(I14<=Basis!$M$22,\"Uit\",(100-(I14/Basis!$L$22*100))*Basis!$Y$19)))","v":35.666666666666671},4,11,20,7,36,{"$f":"IF(N14=\"\",\"\",IF(N14*60+O14>Basis!$U$22,\"Uit\",BL14+BM14))","v":93.600000000000009},null,164.26666666666668,5.833333333333333,7,151.43333333333334,"",null,147,0,"-","-",20,"-","-","-","-","-","-","-","-","-","-","-",null,null,null,null,null,null,null,null,null,null,20,null,null,147,null,"15:56:00","16:03:36","00:07:36",7,36,null,{"$f":"IF(K14=\"\",\"\",IF(ISTEXT(K14),K14,IF(K14>Basis!$N$22,\"Uit\",IF(ISBLANK(L14),K14,K14+L14))))","v":15},50.666666666666671,456,{"$f":"IF(N14=\"\",\"\",IF(BK14<=Basis!$F$22,0,(BK14-Basis!$F$22)*0.4))","v":93.600000000000009},{"$f":"IF(N14=\"\",\"\",IF(BK14>Basis!$G$22,0,(Basis!$G$22-BK14)*0.4))","v":0},113.60000000000001,null,17.5,21,5.833333333333333,7]
[null,"D",146,"807408RV","Floor van der Vorst","Roetsenest's Bellucci","PC. De Reigertjes",null,173,{"$f":"IF(I15=\"\",\"\",IF(ISTEXT(I15),I15,IF(I15<=Basis!$M$22,\"Uit\",(100-(I15/Basis!$L$22*100))*Basis!$Y$19)))","v":42.333333333333336},12,0,"Uit",7,18,{"$f":"IF(N15=\"\",\"\",IF(N15*60+O15>Basis!$U$22,\"Uit\",BL15+BM15))","v":86.4},null,"Uit",7.333333333333333,6.666666666666667,"Uit","3W h.1 d*",null,146,"3W",20,"-","-","-","-","-","-","-","-","-",20,"-","-","-",null,null,null,null,null,null,null,null,null,null,"Uit","3W h.1 d*",null,146,null,"15:54:00","16:01:18","00:07:18",7,18,null,{"$f":"IF(K15=\"\",\"\",IF(ISTEXT(K15),K15,IF(K15>Basis!$N$22,\"Uit\",IF(ISBLANK(L15),K15,K15+L15))))","v":12},54.333333333333336,438,{"$f":"IF(N15=\"\",\"\",IF(BK15<=Basis!$F$22,0,(BK15-Basis!$F$22)*0.4))","v":86.4},{"$f":"IF(N15=\"\",\"\",IF(BK15>Basis!$G$22,0,(Basis!$G$22-BK15)*0.4))","v":0},"Uit",null,22,20,7.333333333333333,6.666666666666667]
[null,"D",142,null,null,null,null,null,"NG",{"$f":"IF(I16=\"\",\"\",IF(ISTEXT(I16),I16,IF(I16<=Basis!$M$22,\"Uit\",(100-(I16/Basis!$L$22*100))*Basis!$Y$19)))","v":"NG"},"NG",null,"NG","","",{"$f":"IF(N16=\"\",\"\",IF(N16*60+O16>Basis!$U$22,\"Uit\",BL16+BM16))","v":""},null,"NG","","","NG","",null,142,"NG","-","-","-","-","-","-","-","-","-","-","-","-","-","-",null,null,null,null,null,null,null,null,null,null,{"$f":"IF(Y16=\"\",\"\",IF(ISTEXT(Y16),Y16,SUM(Y16:AW16)))","v":"NG"},null,null,142,null,"15:46:00",null,"","","",null,{"$f":"IF(K16=\"\",\"\",IF(ISTEXT(K16),K16,IF(K16>Basis!$N$22,\"Uit\",IF(ISBLANK(L16),K16,K16+L16))))","v":"NG"},"NG","",{"$f":"IF(N16=\"\",\"\",IF(BK16<=Basis!$F$22,0,(BK16-Basis!$F$22)*0.4))","v":""},{"$f":"IF(N16=\"\",\"\",IF(BK16>Basis!$G$22,0,(Basis!$G$22-BK16)*0.4))","v":""},"NG",null,null,null,"",""]
[null,"D",145,"841814CB","Bloeme Burgers","Cassandra Z","PC. Breda",null,"NG",{"$f":"IF(I17=\"\",\"\",IF(ISTEXT(I17),I17,IF(I17<=Basis!$M$22,\"Uit\",(100-(I17/Basis!$L$22*100))*Basis!$Y$19)))","v":"NG"},"NG",null,"NG","","",{"$f":"IF(N17=\"\",\"\",IF(N17*60+O17>Basis!$U$22,\"Uit\",BL17+BM17))","v":""},null,"NG","","","NG","",null,145,"NG","-","-","-","-","-","-","-","-","-","-","-","-","-","-",null,null,null,null,null,null,null,null,null,null,{"$f":"IF(Y17=\"\",\"\",IF(ISTEXT(Y17),Y17,SUM(Y17:AW17)))","v":"NG"},null,null,145,null,"15:52:00",null,"","","",null,{"$f":"IF(K17=\"\",\"\",IF(ISTEXT(K17),K17,IF(K17>Basis!$N$22,\"Uit\",IF(ISBLANK(L17),K17,K17+L17))))","v":"NG"},"NG","",{"$f":"IF(N17=\"\",\"\",IF(BK17<=Basis!$F$22,0,(BK17-Basis!$F$22)*0.4))","v":""},{"$f":"IF(N17=\"\",\"\",IF(BK17>Basis!$G$22,0,(Basis!$G$22-BK17)*0.4))","v":""},"NG",null,null,null,"",""]
[null,null,null,null,null,null,null,null,null,{"$f":"IF(I18=\"\",\"\",IF(ISTEXT(I18),I18,IF(I18<=Basis!$M$22,\"Uit\",(100-(I18/Basis!$L$22*100))*Basis!$Y$19)))","v":""},null,null,{"$f":"IF(AX18=\"\",\"\",AX18)","v":""},{"$f":"IF(ISBLANK(BD18),\"\",BF18)","v":""},{"$f":"IF(ISBLANK(BD18),\"\",BG18)","v":""},{"$f":"IF(N18=\"\",\"\",IF(N18*60+O18>Basis!$U$22,\"Uit\",BL18+BM18))","v":""},null,{"$f":"IF(ISTEXT(BJ18),BJ18,IF(OR(ISBLANK(M18),M18=\"\",ISBLANK(Y18)),BJ18,IF(ISTEXT(BN18),BN18,BJ18+BN18)))","v":""},{"$f":"IF(BP18=\"\",\"\",BR18)","v":""},{"$f":"IF(BQ18=\"\",\"\",BS18)","v":""},{"$f":"IF(R18=\"\",\"\",IF(ISTEXT(R18),R18,IF(BP18=\"\",\"\",R18-S18-T18)))","v":""},{"$f":"IF(AY18=\"\",\"\",AY18)","v":""},null,{"$f":"IF($C18=\"\",\"\",$C18)","v":""},null,null,null,null,null,null,null,null,null,null,null,null,null,null,null,null,null,null,null,null,null,null,null,null,null,{"$f":"IF(Y18=\"\",\"\",IF(ISTEXT(Y18),Y18,SUM(Y18:AW18)))","v":""},null,null,{"$f":"IF($C18=\"\",\"\",$C18)","v":""},null,null,null,{"$f":"IF(ISBLANK(BD18),\"\",BD18-BC18)","v":""},{"$f":"IF(ISBLANK(BD18),\"\",MINUTE(BE18))","v":""},{"$f":"IF(ISBLANK(BD18),\"\",SECOND(BE18))","v":""},null,{"$f":"IF(K18=\"\",\"\",IF(ISTEXT(K18),K18,IF(K18>Basis!$N$22,\"Uit\",IF(ISBLANK(L18),K18,K18+L18))))","v":""},{"$f":"IF(OR(ISTEXT(J18),BI18=\"\"),J18,IF(ISTEXT(BI18),BI18,J18+BI18))","v":""},{"$f":"IF(N18=\"\",\"\",N18*60+O18)","v":""},{"$f":"IF(N18=\"\",\"\",IF(BK18<=Basis!$F$22,0,(BK18-Basis!$F$22)*0.4))","v":""},{"$f":"IF(N18=\"\",\"\",IF(BK18>Basis!$G$22,0,(Basis!$G$22-BK18)*0.4))","v":""},{"$f":"IF(M18=\"\",\"\",IF(ISTEXT(M18),M18,IF(ISTEXT(P18),P18,M18+P18)))","v":""},null,null,null,{"$f":"IF(BP18=\"\",\"\",BP18/3)","v":""},{"$f":"IF(BQ18=\"\",\"\",BQ18/3)","v":""}]
[null,null,null,null,null,null,null,null,null,{"$f":"IF(I19=\"\",\"\",IF(ISTEXT(I19),I19,IF(I19<=Basis!$M$22,\"Uit\",(100-(I19/Basis!$L$22*100))*Basis!$Y$19)))","v":""},null,null,"","","",{"$f":"IF(N19=\"\",\"\",IF(N19*60+O19>Basis!$U$22,\"Uit\",BL19+BM19))","v":""},null,"","","","","",null,"",null,null,null,null,null,null,null,null,null,null,null,null,null,null,null,null,null,null,null,null,null,null,null,null,null,"",null,null,"",null,null,null,"","","",null,{"$f":"IF(K19=\"\",\"\",IF(ISTEXT(K19),K19,IF(K19>Basis!$N$22,\"Uit\",IF(ISBLANK(L19),K19,K19+L19))))","v":""},"","",{"$f":"IF(N19=\"\",\"\",IF(BK19<=Basis!$F$22,0,(BK19-Basis!$F$22)*0.4))","v":""},{"$f":"IF(N19=\"\",\"\",IF(BK19>Basis!$G$22,0,(Basis!$G$22-BK19)*0.4))","v":""},"",null,null,null,"",""]
[null,null,null,null,null,null,null,null,null,{"$f":"IF(I20=\"\",\"\",IF(ISTEXT(I20),I20,IF(I20<=Basis!$M$22,\"Uit\",(100-(I20/Basis!$L$22*100))*Basis!$Y$19)))","v":""},null,null,"","","",{"$f":"IF(N20=\"\",\"\",IF(N20*60+O20>Basis!$U$22,\"Uit\",BL20+BM20))","v":""},null,"","","","","",null,"",null,null,null,null,null,null,null,null,null,null,null,null,null,null,null,null,null,null,null,null,null,null,null,null,null,"",null,null,"",null,null,null,"","","",null,{"$f":"IF(K20=\"\",\"\",IF(ISTEXT(K20),K20,IF(K20>Basis!$N$22,\"Uit\",IF(ISBLANK(L20),K20,K20+L20))))","v":""},"","",{"$f":"IF(N20=\"\",\"\",IF(BK20<=Basis!$F$22,0,(BK20-Basis!$F$22)*0.4))","v":""},{"$f":"IF(N20=\"\",\"\",IF(BK20>Basis!$G$22,0,(Basis!$G$22-BK20)*0.4))","v":""},"",null,null,null,"",""]
[null,null,null,null,null,null,null,null,null,{"$f":"IF(I21=\"\",\"\",IF(ISTEXT(I21),I21,IF(I21<=Basis!$M$22,\"Uit\",(100-(I21/Basis!$L$22*100))*Basis!$Y$19)))","v":""},null,null,"","","",{"$f":"IF(N21=\"\",\"\",IF(N21*60+O21>Basis!$U$22,\"Uit\",BL21+BM21))","v":""},null,"","","","","",null,"",null,null,null,null,null,null,null,null,null,null,null,null,null,null,null,null,null,null,null,null,null,null,null,null,null,"",null,null,"",null,null,null,"","","",null,{"$f":"IF(K21=\"\",\"\",IF(ISTEXT(K21),K21,IF(K21>Basis!$N$22,\"Uit\",IF(ISBLANK(L21),K21,K21+L21))))","v":""},"","",{"$f":"IF(N21=\"\",\"\",IF(BK21<=Basis!$F$22,0,(BK21-Basis!$F$22)*0.4))","v":""},{"$f":"IF(N21=\"\",\"\",IF(BK21>Basis!$G$22,0,(Basis!$G$22-BK21)*0.4))","v":""},"",null,null,null,"",""]
[null,null,null,null,null,null,null,null,null,{"$f":"IF(I22=\"\",\"\",IF(ISTEXT(I22),I22,IF(I22<=Basis!$M$22,\"Uit\",(100-(I22/Basis!$L$22*100))*Basis!$Y$19)))","v":""},null,null,"","","",{"$f":"IF(N22=\"\",\"\",IF(N22*60+O22>Basis!$U$22,\"Uit\",BL22+BM22))","v":""},null,"","","","","",null,"",null,null,null,null,null,null,null,null,null,null,null,null,null,null,null,null,null,null,null,null,null,null,null,null,null,"",null,null,"",null,null,null,"","","",null,{"$f":"IF(K22=\"\",\"\",IF(ISTEXT(K22),K22,IF(K22>Basis!$N$22,\"Uit\",IF(ISBLANK(L22),K22,K22+L22))))","v":""},"","",{"$f":"IF(N22=\"\",\"\",IF(BK22<=Basis!$F$22,0,(BK22-Basis!$F$22)*0.4))","v":""},{"$f":"IF(N22=\"\",\"\",IF(BK22>Basis!$G$22,0,(Basis!$G$22-BK22)*0.4))","v":""},"",null,null,null,"",""]
["  Bij uitsluiting reden vermelden : ",null,null,null,null,null,null,null,null,null,null,null,null,null,null,{"$f":"NOW()","v":"2018-06-30T22:02:24.880"},null,null,null,null,null,null,null,{"$f":"A23","v":"  Bij uitsluiting reden vermelden : "},null,null,null,null,null,null,null,null,null,null,null,null,null,null,null,null,null,null,null,null,null,null,{"$f":"NOW()","v":"2018-06-30T22:02:24.880"}]
["  VP=val paard, VR=val ruiter, 3W=3 weigeringen op zelfde hindernis, 4W=4 weigeringen totaal, FP=foutief parcours, Vr.v= vrijwillig verlaten",null,null,null,null,null,null,null,null,null,null,null,null,null,null,null,null,null,null,null,null,null,null,{"$f":"A24","v":"  VP=val paard, VR=val ruiter, 3W=3 weigeringen op zelfde hindernis, 4W=4 weigeringen totaal, FP=foutief parcours, Vr.v= vrijwillig verlaten"}]

{"sheet":"BB Pony's","index":17,"n_rows":22,"n_cols":71,"rows_kept":22,"cut":false,"hidden":false,"merged":[[2,13,2,14],[20,15,20,21],[20,46,20,52]]}
[{"$f":"\" Samengestelde wedstrijd \"&Basis!D18","v":" Samengestelde wedstrijd Eventing Leende 30 juni 2018"},null,null,null,null,null,"Klasse BB - Cat ABCDE",null,null,null,null,"Dressuurjury : ",null,null,null,null,null,null,null,null,null,null,null," Verzamelstaat hindernisfouten in de cross",null,null,null,null,null,null,null,null,null,null,null,null,{"$f":"A1","v":" Samengestelde wedstrijd Eventing Leende 30 juni 2018"},null,null,null,null,null,null,null,null,null,null,null,null,null,null,null,{"$f":"G1&\" \"","v":"Klasse BB - Cat ABCDE "},null," Indien aankomstUUR cross wordt meegedeeld :",null,null,null,null,null," Hulpkolommen",null,null,null,null,null,null," Stijlcijfers :"]
["rank","pony","rugnr","combinatie nr","naam ruiter","naam pony","vereniging / plaats",null,"dressuur","dressuur","hind.ft.","tijd.ft.","hind.ft.","min","sec","tijd.ft.",null,"totaal","(1) stijl","(2) stijl","eind-","reden",null,null,"hindernisnummer",null,null,null,null,null,null,null,null,null,null,null,null,null,null,null,null,null,null,null,null,null,null,null,null,null," ",null,null,null,null,null,null,null,null,null,"Uitslag","NA","tijd (sec)","tijd.ft.","reg.ft.","totaal",null,"Totaal","Totaal","Gemiddelde","Gemiddelde"]
["HC","cat.",null,null,null,null,null,null,"totaal","strafpntn.","springen","springen","cross","cross",null,{"$f":"Basis!$H$22&\":\"&TEXT(Basis!$I$22,\"00\")","v":"3:42"},null,null,"cijfer","cijfer","totaal","uitsluiting",null,"nr",1,2,3,4,5,6,"VD",7,"VD","8ab",9,"10ab",11,12,"F",null,null,null,null,null,null,null,null,null,null,"totaal","reden uitsluiting","hind.","nr",null,"Vertrekuur","Aankomst","Tijd","Minuten","Seconden",null,"Springen","Springen","cross","opt.tijd =",{"$f":"Basis!$H$22&\":\"&TEXT(Basis!$I$22,\"00\")","v":"3:42"},"cross",null,"Jury 1","Jury 2","Jury 1","Jury 2"]
[null,null,null,null,null,null,null,null,null,null,null,null,null,null,null,null,null,{"$f":"IF(ISBLANK(I4),\"\",IF(AND(ISBLANK(K4),ISBLANK(Y4)),J4,IF(ISTEXT(K4),K4,IF(OR(ISBLANK(M4),M4=\"\"),J4+K4+L4,IF(ISTEXT(M4),M4,IF(ISBLANK(Y4),J4+K4+L4,J4+K4+L4+M4+P4+Q4))))))","v":""}]
[1,"D",151,null,"Noa van der Leeuw","Topline's Tamiro","PC. Eendracht Pey",null,150,{"$f":"IF(I5=\"\",\"\",IF(ISTEXT(I5),I5,IF(I5<=Basis!$M$22,\"Uit\",(100-(I5/Basis!$L$22*100))*Basis!$Y$19)))","v":50},0,0,{"$f":"IF(AX5=\"\",\"\",AX5)","v":0},{"$f":"IF(ISBLANK(BD5),\"\",BF5)","v":4},{"$f":"IF(ISBLANK(BD5),\"\",BG5)","v":27},{"$f":"IF(N5=\"\",\"\",IF(N5*60+O5>Basis!$U$22,\"Uit\",BL5+BM5))","v":18},null,{"$f":"IF(ISTEXT(BJ5),BJ5,IF(OR(ISBLANK(M5),M5=\"\",ISBLANK(Y5)),BJ5,IF(ISTEXT(BN5),BN5,BJ5+BN5)))","v":68},{"$f":"IF(BP5=\"\",\"\",BR5)","v":7},{"$f":"IF(BQ5=\"\",\"\",BS5)","v":7.666666666666667},{"$f":"IF(R5=\"\",\"\",IF(ISTEXT(R5),R5,IF(BP5=\"\",\"\",R5-S5-T5)))","v":53.333333333333336},{"$f":"IF(AY5=\"\",\"\",AY5)","v":""},null,{"$f":"IF($C5=\"\",\"\",$C5)","v":151},0,"-","-","-","-","-","-","-","-","-","-","-","-","-","-",null,null,null,null,null,null,null,null,null,null,{"$f":"IF(Y5=\"\",\"\",IF(ISTEXT(Y5),Y5,SUM(Y5:AW5)))","v":0},null,null,{"$f":"IF($C5=\"\",\"\",$C5)","v":151},null,"16:06:00","16:10:27",{"$f":"IF(ISBLANK(BD5),\"\",BD5-BC5)","v":"00:04:27"},{"$f":"IF(ISBLANK(BD5),\"\",MINUTE(BE5))","v":4},{"$f":"IF(ISBLANK(BD5),\"\",SECOND(BE5))","v":27},null,{"$f":"IF(K5=\"\",\"\",IF(ISTEXT(K5),K5,IF(K5>Basis!$N$22,\"Uit\",IF(ISBLANK(L5),K5,K5+L5))))","v":0},{"$f":"IF(OR(ISTEXT(J5),BI5=\"\"),J5,IF(ISTEXT(BI5),BI5,J5+BI5))","v":50},{"$f":"IF(N5=\"\",\"\",N5*60+O5)","v":267},{"$f":"IF(N5=\"\",\"\",IF(BK5<=Basis!$F$22,0,(BK5-Basis!$F$22)*0.4))","v":18},{"$f":"IF(N5=\"\",\"\",IF(BK5>Basis!$G$22,0,(Basis!$G$22-BK5)*0.4))","v":0},{"$f":"IF(M5=\"\",\"\",IF(ISTEXT(M5),M5,IF(ISTEXT(P5),P5,M5+P5)))","v":18},null,21,23,{"$f":"IF(BP5=\"\",\"\",BP5/3)","v":7},{"$f":"IF(BQ5=\"\",\"\",BQ5/3)","v":7.666666666666667}]
[2,"D",152,null,"Josien Thijssens","De Biestermannen's Pepper",null,null,150,{"$f":"IF(I6=\"\",\"\",IF(ISTEXT(I6),I6,IF(I6<=Basis!$M$22,\"Uit\",(100-(I6/Basis!$L$22*100))*Basis!$Y$19)))","v":50},0,0,0,4,31,{"$f":"IF(N6=\"\",\"\",IF(N6*60+O6>Basis!$U$22,\"Uit\",BL6+BM6))","v":19.600000000000001},null,69.599999999999994,6.833333333333333,7,55.766666666666659,"",null,152,0,"-","-","-","-","-","-","-","-","-","-","-","-","-","-",null,null,null,null,null,null,null,null,null,null,0,null,null,152,null,"16:08:00","16:12:31","00:04:31",4,31,null,{"$f":"IF(K6=\"\",\"\",IF(ISTEXT(K6),K6,IF(K6>Basis!$N$22,\"Uit\",IF(ISBLANK(L6),K6,K6+L6))))","v":0},50,271,{"$f":"IF(N6=\"\",\"\",IF(BK6<=Basis!$F$22,0,(BK6-Basis!$F$22)*0.4))","v":19.600000000000001},{"$f":"IF(N6=\"\",\"\",IF(BK6>Basis!$G$22,0,(Basis!$G$22-BK6)*0.4))","v":0},19.600000000000001,null,20.5,21,6.833333333333333,7]
[3,"D",154,null,"Fleur Naus","Boelabeha golden villa",null,null,150,{"$f":"IF(I7=\"\",\"\",IF(ISTEXT(I7),I7,IF(I7<=Basis!$M$22,\"Uit\",(100-(I7/Basis!$L$22*100))*Basis!$Y$19)))","v":50},4,10,0,4,21,{"$f":"IF(N7=\"\",\"\",IF(N7*60+O7>Basis!$U$22,\"Uit\",BL7+BM7))","v":15.600000000000001},null,79.599999999999994,7.333333333333333,7,65.266666666666666,"",null,154,0,"-","-","-","-","-","-","-","-","-","-","-","-","-","-",null,null,null,null,null,null,null,null,null,null,0,null,null,154,null,"16:12:00","16:16:21","00:04:21",4,21,null,{"$f":"IF(K7=\"\",\"\",IF(ISTEXT(K7),K7,IF(K7>Basis!$N$22,\"Uit\",IF(ISBLANK(L7),K7,K7+L7))))","v":14},64,261,{"$f":"IF(N7=\"\",\"\",IF(BK7<=Basis!$F$22,0,(BK7-Basis!$F$22)*0.4))","v":15.600000000000001},{"$f":"IF(N7=\"\",\"\",IF(BK7>Basis!$G$22,0,(Basis!$G$22-BK7)*0.4))","v":0},15.600000000000001,null,22,21,7.333333333333333,7]
[4,"D",156,null,"Tycho van der Heijden","Gloria","PC. Sint Martinus",null,150,{"$f":"IF(I8=\"\",\"\",IF(ISTEXT(I8),I8,IF(I8<=Basis!$M$22,\"Uit\",(100-(I8/Basis!$L$22*100))*Basis!$Y$19)))","v":50},0,0,20,5,16,{"$f":"IF(N8=\"\",\"\",IF(N8*60+O8>Basis!$U$22,\"Uit\",BL8+BM8))","v":37.6},null,107.6,7.166666666666667,7.333333333333333,93.1,"",null,156,20,"-","-","-","-","-","-","-","-","-","-","-","-","-","-",null,null,null,null,null,null,null,null,null,null,20,null,null,156,null,"16:14:00","16:19:16","00:05:16",5,16,null,{"$f":"IF(K8=\"\",\"\",IF(ISTEXT(K8),K8,IF(K8>Basis!$N$22,\"Uit\",IF(ISBLANK(L8),K8,K8+L8))))","v":0},50,316,{"$f":"IF(N8=\"\",\"\",IF(BK8<=Basis!$F$22,0,(BK8-Basis!$F$22)*0.4))","v":37.6},{"$f":"IF(N8=\"\",\"\",IF(BK8>Basis!$G$22,0,(Basis!$G$22-BK8)*0.4))","v":0},57.6,null,21.5,22,7.166666666666667,7.333333333333333]
[5,"D",153,null,"Fleur Leenen","Isabella",null,null,150,{"$f":"IF(I9=\"\",\"\",IF(ISTEXT(I9),I9,IF(I9<=Basis!$M$22,\"Uit\",(100-(I9/Basis!$L$22*100))*Basis!$Y$19)))","v":50},0,1,0,6,36,{"$f":"IF(N9=\"\",\"\",IF(N9*60+O9>Basis!$U$22,\"Uit\",BL9+BM9))","v":69.600000000000009},null,120.60000000000001,6.333333333333333,6.333333333333333,107.93333333333335,"",null,153,0,"-","-","-","-","-","-","-","-","-","-","-","-","-","-",null,null,null,null,null,null,null,null,null,null,0,null,null,153,null,"16:10:00","16:16:36","00:06:36",6,36,null,{"$f":"IF(K9=\"\",\"\",IF(ISTEXT(K9),K9,IF(K9>Basis!$N$22,\"Uit\",IF(ISBLANK(L9),K9,K9+L9))))","v":1},51,396,{"$f":"IF(N9=\"\",\"\",IF(BK9<=Basis!$F$22,0,(BK9-Basis!$F$22)*0.4))","v":69.600000000000009},{"$f":"IF(N9=\"\",\"\",IF(BK9>Basis!$G$22,0,(Basis!$G$22-BK9)*0.4))","v":0},69.600000000000009,null,19,19,6.333333333333333,6.333333333333333]
[6,"D",155,null,"Vera Glazenmakers","Don Chivago Cesar","PC. Neer",null,150,{"$f":"IF(I10=\"\",\"\",IF(ISTEXT(I10),I10,IF(I10<=Basis!$M$22,\"Uit\",(100-(I10/Basis!$L$22*100))*Basis!$Y$19)))","v":50},4,0,40,5,34,{"$f":"IF(N10=\"\",\"\",IF(N10*60+O10>Basis!$U$22,\"Uit\",BL10+BM10))","v":44.800000000000004},null,138.80000000000001,6.333333333333333,6.166666666666667,126.3,"",null,155,20,"-","-",20,"-","-","-","-","-","-","-","-","-","-","-",null,null,null,null,null,null,null,null,null,null,40,null,null,155,null,"16:16:00","16:21:34","00:05:34",5,34,null,{"$f":"IF(K10=\"\",\"\",IF(ISTEXT(K10),K10,IF(K10>Basis!$N$22,\"Uit\",IF(ISBLANK(L10),K10,K10+L10))))","v":4},54,334,{"$f":"IF(N10=\"\",\"\",IF(BK10<=Basis!$F$22,0,(BK10-Basis!$F$22)*0.4))","v":44.800000000000004},{"$f":"IF(N10=\"\",\"\",IF(BK10>Basis!$G$22,0,(Basis!$G$22-BK10)*0.4))","v":0},84.800000000000011,null,19,18.5,6.333333333333333,6.166666666666667]
[null,"B",149,null,"Robey Riethoven","Avalons Rocket","PC. Rynland",null,150,{"$f":"IF(I11=\"\",\"\",IF(ISTEXT(I11),I11,IF(I11<=Basis!$M$20,\"Uit\",(100-(I11/Basis!$L$20*100))*Basis!$Y$19)))","v":50},0,0,"Uit","","",{"$f":"IF(N11=\"\",\"\",IF(N11*60+O11>Basis!$U$20,\"Uit\",BL11+BM11))","v":""},null,"Uit",6,"","Uit","VR h.9",null,149,0,20,20,20,"-","-","-","-","-","-","VR",null,null,null,null,null,null,null,null,null,null,null,null,null,null,"Uit","VR h.9",null,149,null,"16:01:00",null,"","","",null,{"$f":"IF(K11=\"\",\"\",IF(ISTEXT(K11),K11,IF(K11>Basis!$N$20,\"Uit\",IF(ISBLANK(L11),K11,K11+L11))))","v":0},50,"",{"$f":"IF(N11=\"\",\"\",IF(BK11<=Basis!$F$20,0,(BK11-Basis!$F$20)*0.4))","v":""},{"$f":"IF(N11=\"\",\"\",IF(BK11>Basis!$G$20,0,(Basis!$G$20-BK11)*0.4))","v":""},"Uit",null,18,null,6,""]
[null,"D",150,null,"Jana Exalto","Una de Merle","PC. De Kempenruiters",null,150,{"$f":"IF(I12=\"\",\"\",IF(ISTEXT(I12),I12,IF(I12<=Basis!$M$22,\"Uit\",(100-(I12/Basis!$L$22*100))*Basis!$Y$19)))","v":50},0,0,"Uit",6,49,{"$f":"IF(N12=\"\",\"\",IF(N12*60+O12>Basis!$U$22,\"Uit\",BL12+BM12))","v":74.8},null,"Uit",6.333333333333333,7,"Uit","FP h.8",null,150,60,"-","-","-","-","-","-","-","-","FP","-","-","-","-","-",null,null,null,null,null,null,null,null,null,null,"Uit","FP h.8",null,150,null,"16:03:00","16:09:49","00:06:49",6,49,null,{"$f":"IF(K12=\"\",\"\",IF(ISTEXT(K12),K12,IF(K12>Basis!$N$22,\"Uit\",IF(ISBLANK(L12),K12,K12+L12))))","v":0},50,409,{"$f":"IF(N12=\"\",\"\",IF(BK12<=Basis!$F$22,0,(BK12-Basis!$F$22)*0.4))","v":74.8},{"$f":"IF(N12=\"\",\"\",IF(BK12>Basis!$G$22,0,(Basis!$G$22-BK12)*0.4))","v":0},"Uit",null,19,21,6.333333333333333,7]
[null,"D",157,null,"Nienke de Wit","anbally Rebel",null,null,150,{"$f":"IF(I13=\"\",\"\",IF(ISTEXT(I13),I13,IF(I13<=Basis!$M$22,\"Uit\",(100-(I13/Basis!$L$22*100))*Basis!$Y$19)))","v":50},0,0,"Uit","","",{"$f":"IF(N13=\"\",\"\",IF(N13*60+O13>Basis!$U$22,\"Uit\",BL13+BM13))","v":""},null,"Uit","","","Uit","VR h.6",null,157,20,"-","-",20,"-","VR",null,null,null,null,null,null,null,null,null,null,null,null,null,null,null,null,null,null,null,"Uit","VR h.6",null,157,null,"16:18:00",null,"","","",null,{"$f":"IF(K13=\"\",\"\",IF(ISTEXT(K13),K13,IF(K13>Basis!$N$22,\"Uit\",IF(ISBLANK(L13),K13,K13+L13))))","v":0},50,"",{"$f":"IF(N13=\"\",\"\",IF(BK13<=Basis!$F$22,0,(BK13-Basis!$F$22)*0.4))","v":""},{"$f":"IF(N13=\"\",\"\",IF(BK13>Basis!$G$22,0,(Basis!$G$22-BK13)*0.4))","v":""},"Uit",null,null,null,"",""]
[null,"D",159,null,"Shania van Schijndel","Abby",null,null,150,{"$f":"IF(I14=\"\",\"\",IF(ISTEXT(I14),I14,IF(I14<=Basis!$M$22,\"Uit\",(100-(I14/Basis!$L$22*100))*Basis!$Y$19)))","v":50},"FP",null,"NG","","",{"$f":"IF(N14=\"\",\"\",IF(N14*60+O14>Basis!$U$22,\"Uit\",BL14+BM14))","v":""},null,"Uit","","","Uit","FP spr.",null,159,"NG",null,null,null,null,null,null,null,null,null,null,null,null,null,null,null,null,null,null,null,null,null,null,null,null,{"$f":"IF(Y14=\"\",\"\",IF(ISTEXT(Y14),Y14,SUM(Y14:AW14)))","v":"NG"},null,null,159,null,null,null,"","","",null,{"$f":"IF(K14=\"\",\"\",IF(ISTEXT(K14),K14,IF(K14>Basis!$N$22,\"Uit\",IF(ISBLANK(L14),K14,K14+L14))))","v":"FP"},"FP","",{"$f":"IF(N14=\"\",\"\",IF(BK14<=Basis!$F$22,0,(BK14-Basis!$F$22)*0.4))","v":""},{"$f":"IF(N14=\"\",\"\",IF(BK14>Basis!$G$22,0,(Basis!$G$22-BK14)*0.4))","v":""},"NG",null,null,null,"",""]
[null,"D",158,null,null,null,"PC. Rynland",null,150,{"$f":"IF(I15=\"\",\"\",IF(ISTEXT(I15),I15,IF(I15<=Basis!$M$22,\"Uit\",(100-(I15/Basis!$L$22*100))*Basis!$Y$19)))","v":50},"NG",null,"NG","","",{"$f":"IF(N15=\"\",\"\",IF(N15*60+O15>Basis!$U$22,\"Uit\",BL15+BM15))","v":""},null,{"$f":"IF(ISTEXT(BJ15),BJ15,IF(OR(ISBLANK(M15),M15=\"\",ISBLANK(Y15)),BJ15,IF(ISTEXT(BN15),BN15,BJ15+BN15)))","v":"NG"},"","","NG",{"$f":"IF(AY15=\"\",\"\",AY15)","v":""},null,158,"NG",null,null,null,null,null,null,null,null,null,null,null,null,null,null,null,null,null,null,null,null,null,null,null,null,{"$f":"IF(Y15=\"\",\"\",IF(ISTEXT(Y15),Y15,SUM(Y15:AW15)))","v":"NG"},null,null,158,null,null,null,"","","",null,{"$f":"IF(K15=\"\",\"\",IF(ISTEXT(K15),K15,IF(K15>Basis!$N$22,\"Uit\",IF(ISBLANK(L15),K15,K15+L15))))","v":"NG"},"NG","",{"$f":"IF(N15=\"\",\"\",IF(BK15<=Basis!$F$22,0,(BK15-Basis!$F$22)*0.4))","v":""},{"$f":"IF(N15=\"\",\"\",IF(BK15>Basis!$G$22,0,(Basis!$G$22-BK15)*0.4))","v":""},"NG",null,null,null,"",""]
[null,null,null,null,null,null,null,null,null,{"$f":"IF(I16=\"\",\"\",IF(ISTEXT(I16),I16,IF(I16<=Basis!$M$22,\"Uit\",(100-(I16/Basis!$L$22*100))*Basis!$Y$19)))","v":""},null,null,{"$f":"IF(AX16=\"\",\"\",AX16)","v":""},{"$f":"IF(ISBLANK(BD16),\"\",BF16)","v":""},{"$f":"IF(ISBLANK(BD16),\"\",BG16)","v":""},{"$f":"IF(N16=\"\",\"\",IF(N16*60+O16>Basis!$U$22,\"Uit\",BL16+BM16))","v":""},null,{"$f":"IF(ISTEXT(BJ16),BJ16,IF(OR(ISBLANK(M16),M16=\"\",ISBLANK(Y16)),BJ16,IF(ISTEXT(BN16),BN16,BJ16+BN16)))","v":""},{"$f":"IF(BP16=\"\",\"\",BR16)","v":""},{"$f":"IF(BQ16=\"\",\"\",BS16)","v":""},{"$f":"IF(R16=\"\",\"\",IF(ISTEXT(R16),R16,IF(BP16=\"\",\"\",R16-S16-T16)))","v":""},{"$f":"IF(AY16=\"\",\"\",AY16)","v":""},null,{"$f":"IF($C16=\"\",\"\",$C16)","v":""},null,null,null,null,null,null,null,null,null,null,null,null,null,null,null,null,null,null,null,null,null,null,null,null,null,{"$f":"IF(Y16=\"\",\"\",IF(ISTEXT(Y16),Y16,SUM(Y16:AW16)))","v":""},null,null,{"$f":"IF($C16=\"\",\"\",$C16)","v":""},null,null,null,{"$f":"IF(ISBLANK(BD16),\"\",BD16-BC16)","v":""},{"$f":"IF(ISBLANK(BD16),\"\",MINUTE(BE16))","v":""},{"$f":"IF(ISBLANK(BD16),\"\",SECOND(BE16))","v":""},null,{"$f":"IF(K16=\"\",\"\",IF(ISTEXT(K16),K16,IF(K16>Basis!$N$22,\"Uit\",IF(ISBLANK(L16),K16,K16+L16))))","v":""},{"$f":"IF(OR(ISTEXT(J16),BI16=\"\"),J16,IF(ISTEXT(BI16),BI16,J16+BI16))","v":""},{"$f":"IF(N16=\"\",\"\",N16*60+O16)","v":""},{"$f":"IF(N16=\"\",\"\",IF(BK16<=Basis!$F$22,0,(BK16-Basis!$F$22)*0.4))","v":""},{"$f":"IF(N16=\"\",\"\",IF(BK16>Basis!$G$22,0,(Basis!$G$22-BK16)*0.4))","v":""},{"$f":"IF(M16=\"\",\"\",IF(ISTEXT(M16),M16,IF(ISTEXT(P16),P16,M16+P16)))","v":""},null,null,null,{"$f":"IF(BP16=\"\",\"\",BP16/3)","v":""},{"$f":"IF(BQ16=\"\",\"\",BQ16/3)","v":""}]
[null,null,null,null,null,null,null,null,null,{"$f":"IF(I17=\"\",\"\",IF(ISTEXT(I17),I17,IF(I17<=Basis!$M$22,\"Uit\",(100-(I17/Basis!$L$22*100))*Basis!$Y$19)))","v":""},null,null,"","","",{"$f":"IF(N17=\"\",\"\",IF(N17*60+O17>Basis!$U$22,\"Uit\",BL17+BM17))","v":""},null,"","","","","",null,"",null,null,null,null,null,null,null,null,null,null,null,null,null,null,null,null,null,null,null,null,null,null,null,null,null,"",null,null,"",null,null,null,"","","",null,{"$f":"IF(K17=\"\",\"\",IF(ISTEXT(K17),K17,IF(K17>Basis!$N$22,\"Uit\",IF(ISBLANK(L17),K17,K17+L17))))","v":""},"","",{"$f":"IF(N17=\"\",\"\",IF(BK17<=Basis!$F$22,0,(BK17-Basis!$F$22)*0.4))","v":""},{"$f":"IF(N17=\"\",\"\",IF(BK17>Basis!$G$22,0,(Basis!$G$22-BK17)*0.4))","v":""},"",null,null,null,"",""]
[null,null,null,null,null,null,null,null,null,{"$f":"IF(I18=\"\",\"\",IF(ISTEXT(I18),I18,IF(I18<=Basis!$M$22,\"Uit\",(100-(I18/Basis!$L$22*100))*Basis!$Y$19)))","v":""},null,null,"","","",{"$f":"IF(N18=\"\",\"\",IF(N18*60+O18>Basis!$U$22,\"Uit\",BL18+BM18))","v":""},null,"","","","","",null,"",null,null,null,null,null,null,null,null,null,null,null,null,null,null,null,null,null,null,null,null,null,null,null,null,null,"",null,null,"",null,null,null,"","","",null,{"$f":"IF(K18=\"\",\"\",IF(ISTEXT(K18),K18,IF(K18>Basis!$N$22,\"Uit\",IF(ISBLANK(L18),K18,K18+L18))))","v":""},"","",{"$f":"IF(N18=\"\",\"\",IF(BK18<=Basis!$F$22,0,(BK18-Basis!$F$22)*0.4))","v":""},{"$f":"IF(N18=\"\",\"\",IF(BK18>Basis!$G$22,0,(Basis!$G$22-BK18)*0.4))","v":""},"",null,null,null,"",""]
[null,null,null,null,null,null,null,null,null,{"$f":"IF(I19=\"\",\"\",IF(ISTEXT(I19),I19,IF(I19<=Basis!$M$22,\"Uit\",(100-(I19/Basis!$L$22*100))*Basis!$Y$19)))","v":""},null,null,"","","",{"$f":"IF(N19=\"\",\"\",IF(N19*60+O19>Basis!$U$22,\"Uit\",BL19+BM19))","v":""},null,"","","","","",null,"",null,null,null,null,null,null,null,null,null,null,null,null,null,null,null,null,null,null,null,null,null,null,null,null,null,"",null,null,"",null,null,null,"","","",null,{"$f":"IF(K19=\"\",\"\",IF(ISTEXT(K19),K19,IF(K19>Basis!$N$22,\"Uit\",IF(ISBLANK(L19),K19,K19+L19))))","v":""},"","",{"$f":"IF(N19=\"\",\"\",IF(BK19<=Basis!$F$22,0,(BK19-Basis!$F$22)*0.4))","v":""},{"$f":"IF(N19=\"\",\"\",IF(BK19>Basis!$G$22,0,(Basis!$G$22-BK19)*0.4))","v":""},"",null,null,null,"",""]
[null,null,null,null,null,null,null,null,null,{"$f":"IF(I20=\"\",\"\",IF(ISTEXT(I20),I20,IF(I20<=Basis!$M$22,\"Uit\",(100-(I20/Basis!$L$22*100))*Basis!$Y$19)))","v":""},null,null,"","","",{"$f":"IF(N20=\"\",\"\",IF(N20*60+O20>Basis!$U$22,\"Uit\",BL20+BM20))","v":""},null,"","","","","",null,"",null,null,null,null,null,null,null,null,null,null,null,null,null,null,null,null,null,null,null,null,null,null,null,null,null,"",null,null,"",null,null,null,"","","",null,{"$f":"IF(K20=\"\",\"\",IF(ISTEXT(K20),K20,IF(K20>Basis!$N$22,\"Uit\",IF(ISBLANK(L20),K20,K20+L20))))","v":""},"","",{"$f":"IF(N20=\"\",\"\",IF(BK20<=Basis!$F$22,0,(BK20-Basis!$F$22)*0.4))","v":""},{"$f":"IF(N20=\"\",\"\",IF(BK20>Basis!$G$22,0,(Basis!$G$22-BK20)*0.4))","v":""},"",null,null,null,"",""]
["  Bij uitsluiting reden vermelden : ",null,null,null,null,null,null,null,null,null,null,null,null,null,null,{"$f":"NOW()","v":"2018-06-30T22:02:24.880"},null,null,null,null,null,null,null,{"$f":"A21","v":"  Bij uitsluiting reden vermelden : "},null,null,null,null,null,null,null,null,null,null,null,null,null,null,null,null,null,null,null,null,null,null,{"$f":"NOW()","v":"2018-06-30T22:02:24.880"}]
["  VP=val paard, VR=val ruiter, 3W=3 weigeringen op zelfde hindernis, 4W=4 weigeringen totaal, FP=foutief parcours, Vr.v= vrijwillig verlaten",null,null,null,null,null,null,null,null,null,null,null,null,null,null,null,null,null,null,null,null,null,null,{"$f":"A22","v":"  VP=val paard, VR=val ruiter, 3W=3 weigeringen op zelfde hindernis, 4W=4 weigeringen totaal, FP=foutief parcours, Vr.v= vrijwillig verlaten"}]

{"sheet":"Pony's Z-CDE","index":18,"n_rows":31,"n_cols":66,"rows_kept":31,"cut":false,"hidden":true,"merged":[[2,13,2,14],[29,15,29,21],[29,46,29,52],[1,7,1,8]]}
[{"$f":"\" Samengestelde wedstrijd \"&Basis!D18","v":" Samengestelde wedstrijd Eventing Leende 30 juni 2018"},null,null,null,null,null,"Klasse Z - Cat CDE - Ring 6",null,null,null,null,"Dressuurjury : ",null,null,null,null,null,null,null,null,null,null,null," Verzamelstaat hindernisfouten in de cross",null,null,null,null,null,null,null,null,null,null,null,null,{"$f":"A1","v":" Samengestelde wedstrijd Eventing Leende 30 juni 2018"},null,null,null,null,null,null,null,null,null,null,null,null,null,null,null,{"$f":"G1&\" \"","v":"Klasse Z - Cat CDE - Ring 6 "},null," Indien aankomstUUR cross wordt meegedeeld :",null,null,null,null,null," Hulpkolommen"]
["rank","pony","rugnr","combinatie nr","naam ruiter","naam pony","vereniging / plaats","dressuur",null,"dressuur","hind.ft.","tijd.ft.","hind.ft.","min","sec","tijd.ft.",null,"totaal","(1) stijl","(2) stijl","eind-","reden",null,null,"hindernisnummer",null,null,null,null,null,null,null,null,null,null,null,null,null,null,null,null,null,null,null,null,null,null,null,null,null," ",null,null,null,null,null,null,null,null,null,"Uitslag","NA","tijd (sec)","tijd.ft.","reg.ft.","totaal"]
["HC","cat.",null,null,null,null,null,"Jury C","Jury 2","strafpntn.","springen","springen","cross","cross",null,{"$f":"Basis!$H$27&\":\"&TEXT(Basis!$I$27,\"00\")","v":"4:24"},null,null,"cijfer","cijfer","totaal","uitsluiting",null,"nr",1,2,3,4,5,6,7,8,9,10,11,12,13,14,15,16,17,18,19,20,21,22,23,24,25,"totaal","reden uitsluiting","hind.","nr",null,"Vertrekuur","Aankomst","Tijd","Minuten","Seconden",null,"Springen","Springen","cross","opt.tijd =",{"$f":"Basis!$H$27&\":\"&TEXT(Basis!$I$27,\"00\")","v":"4:24"},"cross"]
[null,null,null,null,null,null,null,null,null,null,null,null,null,null,null,null,null,{"$f":"IF(ISBLANK(I4),\"\",IF(AND(ISBLANK(K4),ISBLANK(Y4)),J4,IF(ISTEXT(K4),K4,IF(OR(ISBLANK(M4),M4=\"\"),J4+K4+L4,IF(ISTEXT(M4),M4,IF(ISBLANK(Y4),J4+K4+L4,J4+K4+L4+M4+P4+Q4))))))","v":""}]
[null,null,1,null,null,null,null,null,null,{"$f":"IF(H5=\"\",\"\",IF(ISTEXT(H5),H5,IF(I5=\"\",\"\",IF((H5+I5)/2<=Basis!$M$27,\"Uit\",(100-((H5+I5)/2/Basis!$L$27*100))*Basis!$Y$19))))","v":""},null,null,{"$f":"IF(AX5=\"\",\"\",AX5)","v":""},{"$f":"IF(ISBLANK(BD5),\"\",BF5)","v":""},{"$f":"IF(ISBLANK(BD5),\"\",BG5)","v":""},{"$f":"IF(N5=\"\",\"\",IF(N5*60+O5>Basis!$U$27,\"Uit\",BL5+BM5))","v":""},null,{"$f":"IF(ISTEXT(BJ5),BJ5,IF(OR(ISBLANK(M5),M5=\"\",ISBLANK(Y5)),BJ5,IF(ISTEXT(BN5),BN5,BJ5+BN5)))","v":""},null,null,{"$f":"IF(R5=\"\",\"\",IF(ISTEXT(R5),R5,R5-S5-T5))","v":""},{"$f":"IF(AY5=\"\",\"\",AY5)","v":""},null,{"$f":"IF($C5=\"\",\"\",$C5)","v":1},null,"-","-","-","-","-","-","-","-","-","-","-","-","-","-","-","-","-","-","-","-","-","-","-","-",{"$f":"IF(Y5=\"\",\"\",IF(ISTEXT(Y5),Y5,SUM(Y5:AW5)))","v":""},null,null,{"$f":"IF($C5=\"\",\"\",$C5)","v":1},null,"10:00:00",null,{"$f":"IF(ISBLANK(BD5),\"\",BD5-BC5)","v":""},{"$f":"IF(ISBLANK(BD5),\"\",MINUTE(BE5))","v":""},{"$f":"IF(ISBLANK(BD5),\"\",SECOND(BE5))","v":""},null,{"$f":"IF(K5=\"\",\"\",IF(ISTEXT(K5),K5,IF(K5>Basis!$N$27,\"Uit\",IF(ISBLANK(L5),K5,K5+L5))))","v":""},{"$f":"IF(OR(ISTEXT(J5),BI5=\"\"),J5,IF(ISTEXT(BI5),BI5,J5+BI5))","v":""},{"$f":"IF(N5=\"\",\"\",N5*60+O5)","v":""},{"$f":"IF(N5=\"\",\"\",IF(BK5<=Basis!$F$27,0,(BK5-Basis!$F$27)*0.4))","v":""},{"$f":"IF(N5=\"\",\"\",IF(BK5>Basis!$G$27,0,(Basis!$G$27-BK5)*0.4))","v":""},{"$f":"IF(M5=\"\",\"\",IF(ISTEXT(M5),M5,IF(ISTEXT(P5),P5,M5+P5)))","v":""}]
[null,null,2,null,null,null,null,null,null,{"$f":"IF(H6=\"\",\"\",IF(ISTEXT(H6),H6,IF(I6=\"\",\"\",IF((H6+I6)/2<=Basis!$M$27,\"Uit\",(100-((H6+I6)/2/Basis!$L$27*100))*Basis!$Y$19))))","v":""},null,null,"","","",{"$f":"IF(N6=\"\",\"\",IF(N6*60+O6>Basis!$U$27,\"Uit\",BL6+BM6))","v":""},null,"",null,null,"","",null,2,null,"-","-","-","-","-","-","-","-","-","-","-","-","-","-","-","-","-","-","-","-","-","-","-","-","",null,null,2,null,"10:02:00",null,"","","",null,{"$f":"IF(K6=\"\",\"\",IF(ISTEXT(K6),K6,IF(K6>Basis!$N$27,\"Uit\",IF(ISBLANK(L6),K6,K6+L6))))","v":""},{"$f":"IF(OR(ISTEXT(J6),BI6=\"\"),J6,IF(ISTEXT(BI6),BI6,J6+BI6))","v":""},{"$f":"IF(N6=\"\",\"\",N6*60+O6)","v":""},{"$f":"IF(N6=\"\",\"\",IF(BK6<=Basis!$F$27,0,(BK6-Basis!$F$27)*0.4))","v":""},{"$f":"IF(N6=\"\",\"\",IF(BK6>Basis!$G$27,0,(Basis!$G$27-BK6)*0.4))","v":""},{"$f":"IF(M6=\"\",\"\",IF(ISTEXT(M6),M6,IF(ISTEXT(P6),P6,M6+P6)))","v":""}]
[null,null,3,null,null,null,null,null,null,{"$f":"IF(H7=\"\",\"\",IF(ISTEXT(H7),H7,IF(I7=\"\",\"\",IF((H7+I7)/2<=Basis!$M$27,\"Uit\",(100-((H7+I7)/2/Basis!$L$27*100))*Basis!$Y$19))))","v":""},null,null,"","","",{"$f":"IF(N7=\"\",\"\",IF(N7*60+O7>Basis!$U$27,\"Uit\",BL7+BM7))","v":""},null,"",null,null,"","",null,3,null,"-","-","-","-","-","-","-","-","-","-","-","-","-","-","-","-","-","-","-","-","-","-","-","-","",null,null,3,null,"10:04:00",null,"","","",null,{"$f":"IF(K7=\"\",\"\",IF(ISTEXT(K7),K7,IF(K7>Basis!$N$27,\"Uit\",IF(ISBLANK(L7),K7,K7+L7))))","v":""},"","",{"$f":"IF(N7=\"\",\"\",IF(BK7<=Basis!$F$27,0,(BK7-Basis!$F$27)*0.4))","v":""},{"$f":"IF(N7=\"\",\"\",IF(BK7>Basis!$G$27,0,(Basis!$G$27-BK7)*0.4))","v":""},""]
[null,null,4,null,null,null,null,null,null,{"$f":"IF(H8=\"\",\"\",IF(ISTEXT(H8),H8,IF(I8=\"\",\"\",IF((H8+I8)/2<=Basis!$M$27,\"Uit\",(100-((H8+I8)/2/Basis!$L$27*100))*Basis!$Y$19))))","v":""},null,null,"","","",{"$f":"IF(N8=\"\",\"\",IF(N8*60+O8>Basis!$U$27,\"Uit\",BL8+BM8))","v":""},null,"",null,null,"","",null,4,null,"-","-","-","-","-","-","-","-","-","-","-","-","-","-","-","-","-","-","-","-","-","-","-","-","",null,null,4,null,null,null,"","","",null,{"$f":"IF(K8=\"\",\"\",IF(ISTEXT(K8),K8,IF(K8>Basis!$N$27,\"Uit\",IF(ISBLANK(L8),K8,K8+L8))))","v":""},"","",{"$f":"IF(N8=\"\",\"\",IF(BK8<=Basis!$F$27,0,(BK8-Basis!$F$27)*0.4))","v":""},{"$f":"IF(N8=\"\",\"\",IF(BK8>Basis!$G$27,0,(Basis!$G$27-BK8)*0.4))","v":""},""]
[null,null,5,null,null,null,null,null,null,{"$f":"IF(H9=\"\",\"\",IF(ISTEXT(H9),H9,IF(I9=\"\",\"\",IF((H9+I9)/2<=Basis!$M$27,\"Uit\",(100-((H9+I9)/2/Basis!$L$27*100))*Basis!$Y$19))))","v":""},null,null,"","","",{"$f":"IF(N9=\"\",\"\",IF(N9*60+O9>Basis!$U$27,\"Uit\",BL9+BM9))","v":""},null,"",null,null,"","",null,5,null,"-","-","-","-","-","-","-","-","-","-","-","-","-","-","-","-","-","-","-","-","-","-","-","-","",null,null,5,null,null,null,"","","",null,{"$f":"IF(K9=\"\",\"\",IF(ISTEXT(K9),K9,IF(K9>Basis!$N$27,\"Uit\",IF(ISBLANK(L9),K9,K9+L9))))","v":""},"","",{"$f":"IF(N9=\"\",\"\",IF(BK9<=Basis!$F$27,0,(BK9-Basis!$F$27)*0.4))","v":""},{"$f":"IF(N9=\"\",\"\",IF(BK9>Basis!$G$27,0,(Basis!$G$27-BK9)*0.4))","v":""},""]
[null,null,6,null,null,null,null,null,null,{"$f":"IF(H10=\"\",\"\",IF(ISTEXT(H10),H10,IF(I10=\"\",\"\",IF((H10+I10)/2<=Basis!$M$27,\"Uit\",(100-((H10+I10)/2/Basis!$L$27*100))*Basis!$Y$19))))","v":""},null,null,"","","",{"$f":"IF(N10=\"\",\"\",IF(N10*60+O10>Basis!$U$27,\"Uit\",BL10+BM10))","v":""},null,"",null,null,"","",null,6,null,"-","-","-","-","-","-","-","-","-","-","-","-","-","-","-","-","-","-","-","-","-","-","-","-","",null,null,6,null,null,null,"","","",null,{"$f":"IF(K10=\"\",\"\",IF(ISTEXT(K10),K10,IF(K10>Basis!$N$27,\"Uit\",IF(ISBLANK(L10),K10,K10+L10))))","v":""},"","",{"$f":"IF(N10=\"\",\"\",IF(BK10<=Basis!$F$27,0,(BK10-Basis!$F$27)*0.4))","v":""},{"$f":"IF(N10=\"\",\"\",IF(BK10>Basis!$G$27,0,(Basis!$G$27-BK10)*0.4))","v":""},""]
[null,null,7,null,null,null,null,null,null,{"$f":"IF(H11=\"\",\"\",IF(ISTEXT(H11),H11,IF(I11=\"\",\"\",IF((H11+I11)/2<=Basis!$M$27,\"Uit\",(100-((H11+I11)/2/Basis!$L$27*100))*Basis!$Y$19))))","v":""},null,null,"","","",{"$f":"IF(N11=\"\",\"\",IF(N11*60+O11>Basis!$U$27,\"Uit\",BL11+BM11))","v":""},null,"",null,null,"","",null,7,null,"-","-","-","-","-","-","-","-","-","-","-","-","-","-","-","-","-","-","-","-","-","-","-","-","",null,null,7,null,null,null,"","","",null,{"$f":"IF(K11=\"\",\"\",IF(ISTEXT(K11),K11,IF(K11>Basis!$N$27,\"Uit\",IF(ISBLANK(L11),K11,K11+L11))))","v":""},"","",{"$f":"IF(N11=\"\",\"\",IF(BK11<=Basis!$F$27,0,(BK11-Basis!$F$27)*0.4))","v":""},{"$f":"IF(N11=\"\",\"\",IF(BK11>Basis!$G$27,0,(Basis!$G$27-BK11)*0.4))","v":""},""]
[null,null,8,null,null,null,null,null,null,{"$f":"IF(H12=\"\",\"\",IF(ISTEXT(H12),H12,IF(I12=\"\",\"\",IF((H12+I12)/2<=Basis!$M$27,\"Uit\",(100-((H12+I12)/2/Basis!$L$27*100))*Basis!$Y$19))))","v":""},null,null,"","","",{"$f":"IF(N12=\"\",\"\",IF(N12*60+O12>Basis!$U$27,\"Uit\",BL12+BM12))","v":""},null,"",null,null,"","",null,8,null,"-","-","-","-","-","-","-","-","-","-","-","-","-","-","-","-","-","-","-","-","-","-","-","-","",null,null,8,null,null,null,"","","",null,{"$f":"IF(K12=\"\",\"\",IF(ISTEXT(K12),K12,IF(K12>Basis!$N$27,\"Uit\",IF(ISBLANK(L12),K12,K12+L12))))","v":""},"","",{"$f":"IF(N12=\"\",\"\",IF(BK12<=Basis!$F$27,0,(BK12-Basis!$F$27)*0.4))","v":""},{"$f":"IF(N12=\"\",\"\",IF(BK12>Basis!$G$27,0,(Basis!$G$27-BK12)*0.4))","v":""},""]
[null,null,9,null,null,null,null,null,null,{"$f":"IF(H13=\"\",\"\",IF(ISTEXT(H13),H13,IF(I13=\"\",\"\",IF((H13+I13)/2<=Basis!$M$27,\"Uit\",(100-((H13+I13)/2/Basis!$L$27*100))*Basis!$Y$19))))","v":""},null,null,"","","",{"$f":"IF(N13=\"\",\"\",IF(N13*60+O13>Basis!$U$27,\"Uit\",BL13+BM13))","v":""},null,"",null,null,"","",null,9,null,"-","-","-","-","-","-","-","-","-","-","-","-","-","-","-","-","-","-","-","-","-","-","-","-","",null,null,9,null,null,null,"","","",null,{"$f":"IF(K13=\"\",\"\",IF(ISTEXT(K13),K13,IF(K13>Basis!$N$27,\"Uit\",IF(ISBLANK(L13),K13,K13+L13))))","v":""},"","",{"$f":"IF(N13=\"\",\"\",IF(BK13<=Basis!$F$27,0,(BK13-Basis!$F$27)*0.4))","v":""},{"$f":"IF(N13=\"\",\"\",IF(BK13>Basis!$G$27,0,(Basis!$G$27-BK13)*0.4))","v":""},""]
[null,null,10,null,null,null,null,null,null,{"$f":"IF(H14=\"\",\"\",IF(ISTEXT(H14),H14,IF(I14=\"\",\"\",IF((H14+I14)/2<=Basis!$M$27,\"Uit\",(100-((H14+I14)/2/Basis!$L$27*100))*Basis!$Y$19))))","v":""},null,null,"","","",{"$f":"IF(N14=\"\",\"\",IF(N14*60+O14>Basis!$U$27,\"Uit\",BL14+BM14))","v":""},null,"",null,null,"","",null,10,null,"-","-","-","-","-","-","-","-","-","-","-","-","-","-","-","-","-","-","-","-","-","-","-","-","",null,null,10,null,null,null,"","","",null,{"$f":"IF(K14=\"\",\"\",IF(ISTEXT(K14),K14,IF(K14>Basis!$N$27,\"Uit\",IF(ISBLANK(L14),K14,K14+L14))))","v":""},"","",{"$f":"IF(N14=\"\",\"\",IF(BK14<=Basis!$F$27,0,(BK14-Basis!$F$27)*0.4))","v":""},{"$f":"IF(N14=\"\",\"\",IF(BK14>Basis!$G$27,0,(Basis!$G$27-BK14)*0.4))","v":""},""]
[null,null,null,null,null,null,null,null,null,{"$f":"IF(H15=\"\",\"\",IF(ISTEXT(H15),H15,IF(I15=\"\",\"\",IF((H15+I15)/2<=Basis!$M$27,\"Uit\",(100-((H15+I15)/2/Basis!$L$27*100))*Basis!$Y$19))))","v":""},null,null,"","","",{"$f":"IF(N15=\"\",\"\",IF(N15*60+O15>Basis!$U$27,\"Uit\",BL15+BM15))","v":""},null,"",null,null,"","",null,"",null,"-","-","-","-","-","-","-","-","-","-","-","-","-","-","-","-","-","-","-","-","-","-","-","-","",null,null,"",null,null,null,"","","",null,{"$f":"IF(K15=\"\",\"\",IF(ISTEXT(K15),K15,IF(K15>Basis!$N$27,\"Uit\",IF(ISBLANK(L15),K15,K15+L15))))","v":""},"","",{"$f":"IF(N15=\"\",\"\",IF(BK15<=Basis!$F$27,0,(BK15-Basis!$F$27)*0.4))","v":""},{"$f":"IF(N15=\"\",\"\",IF(BK15>Basis!$G$27,0,(Basis!$G$27-BK15)*0.4))","v":""},""]
[null,null,null,null,null,null,null,null,null,{"$f":"IF(H16=\"\",\"\",IF(ISTEXT(H16),H16,IF(I16=\"\",\"\",IF((H16+I16)/2<=Basis!$M$27,\"Uit\",(100-((H16+I16)/2/Basis!$L$27*100))*Basis!$Y$19))))","v":""},null,null,"","","",{"$f":"IF(N16=\"\",\"\",IF(N16*60+O16>Basis!$U$27,\"Uit\",BL16+BM16))","v":""},null,"",null,null,"","",null,"",null,"-","-","-","-","-","-","-","-","-","-","-","-","-","-","-","-","-","-","-","-","-","-","-","-","",null,null,"",null,null,null,"","","",null,{"$f":"IF(K16=\"\",\"\",IF(ISTEXT(K16),K16,IF(K16>Basis!$N$27,\"Uit\",IF(ISBLANK(L16),K16,K16+L16))))","v":""},"","",{"$f":"IF(N16=\"\",\"\",IF(BK16<=Basis!$F$27,0,(BK16-Basis!$F$27)*0.4))","v":""},{"$f":"IF(N16=\"\",\"\",IF(BK16>Basis!$G$27,0,(Basis!$G$27-BK16)*0.4))","v":""},""]
[null,null,null,null,null,null,null,null,null,{"$f":"IF(H17=\"\",\"\",IF(ISTEXT(H17),H17,IF(I17=\"\",\"\",IF((H17+I17)/2<=Basis!$M$27,\"Uit\",(100-((H17+I17)/2/Basis!$L$27*100))*Basis!$Y$19))))","v":""},null,null,"","","",{"$f":"IF(N17=\"\",\"\",IF(N17*60+O17>Basis!$U$27,\"Uit\",BL17+BM17))","v":""},null,"",null,null,"","",null,"",null,"-","-","-","-","-","-","-","-","-","-","-","-","-","-","-","-","-","-","-","-","-","-","-","-","",null,null,"",null,null,null,"","","",null,{"$f":"IF(K17=\"\",\"\",IF(ISTEXT(K17),K17,IF(K17>Basis!$N$27,\"Uit\",IF(ISBLANK(L17),K17,K17+L17))))","v":""},"","",{"$f":"IF(N17=\"\",\"\",IF(BK17<=Basis!$F$27,0,(BK17-Basis!$F$27)*0.4))","v":""},{"$f":"IF(N17=\"\",\"\",IF(BK17>Basis!$G$27,0,(Basis!$G$27-BK17)*0.4))","v":""},""]
[null,null,null,null,null,null,null,null,null,{"$f":"IF(H18=\"\",\"\",IF(ISTEXT(H18),H18,IF(I18=\"\",\"\",IF((H18+I18)/2<=Basis!$M$27,\"Uit\",(100-((H18+I18)/2/Basis!$L$27*100))*Basis!$Y$19))))","v":""},null,null,"","","",{"$f":"IF(N18=\"\",\"\",IF(N18*60+O18>Basis!$U$27,\"Uit\",BL18+BM18))","v":""},null,"",null,null,"","",null,"",null,"-","-","-","-","-","-","-","-","-","-","-","-","-","-","-","-","-","-","-","-","-","-","-","-","",null,null,"",null,null,null,"","","",null,{"$f":"IF(K18=\"\",\"\",IF(ISTEXT(K18),K18,IF(K18>Basis!$N$27,\"Uit\",IF(ISBLANK(L18),K18,K18+L18))))","v":""},"","",{"$f":"IF(N18=\"\",\"\",IF(BK18<=Basis!$F$27,0,(BK18-Basis!$F$27)*0.4))","v":""},{"$f":"IF(N18=\"\",\"\",IF(BK18>Basis!$G$27,0,(Basis!$G$27-BK18)*0.4))","v":""},""]
[null,null,null,null,null,null,null,null,null,{"$f":"IF(H19=\"\",\"\",IF(ISTEXT(H19),H19,IF(I19=\"\",\"\",IF((H19+I19)/2<=Basis!$M$27,\"Uit\",(100-((H19+I19)/2/Basis!$L$27*100))*Basis!$Y$19))))","v":""},null,null,"","","",{"$f":"IF(N19=\"\",\"\",IF(N19*60+O19>Basis!$U$27,\"Uit\",BL19+BM19))","v":""},null,"",null,null,"","",null,"",null,"-","-","-","-","-","-","-","-","-","-","-","-","-","-","-","-","-","-","-","-","-","-","-","-","",null,null,"",null,null,null,"","","",null,{"$f":"IF(K19=\"\",\"\",IF(ISTEXT(K19),K19,IF(K19>Basis!$N$27,\"Uit\",IF(ISBLANK(L19),K19,K19+L19))))","v":""},"","",{"$f":"IF(N19=\"\",\"\",IF(BK19<=Basis!$F$27,0,(BK19-Basis!$F$27)*0.4))","v":""},{"$f":"IF(N19=\"\",\"\",IF(BK19>Basis!$G$27,0,(Basis!$G$27-BK19)*0.4))","v":""},""]
[null,null,null,null,null,null,null,null,null,{"$f":"IF(H20=\"\",\"\",IF(ISTEXT(H20),H20,IF(I20=\"\",\"\",IF((H20+I20)/2<=Basis!$M$27,\"Uit\",(100-((H20+I20)/2/Basis!$L$27*100))*Basis!$Y$19))))","v":""},null,null,"","","",{"$f":"IF(N20=\"\",\"\",IF(N20*60+O20>Basis!$U$27,\"Uit\",BL20+BM20))","v":""},null,"",null,null,"","",null,"",null,"-","-","-","-","-","-","-","-","-","-","-","-","-","-","-","-","-","-","-","-","-","-","-","-","",null,null,"",null,null,null,"","","",null,{"$f":"IF(K20=\"\",\"\",IF(ISTEXT(K20),K20,IF(K20>Basis!$N$27,\"Uit\",IF(ISBLANK(L20),K20,K20+L20))))","v":""},"","",{"$f":"IF(N20=\"\",\"\",IF(BK20<=Basis!$F$27,0,(BK20-Basis!$F$27)*0.4))","v":""},{"$f":"IF(N20=\"\",\"\",IF(BK20>Basis!$G$27,0,(Basis!$G$27-BK20)*0.4))","v":""},""]
[null,null,null,null,null,null,null,null,null,{"$f":"IF(H21=\"\",\"\",IF(ISTEXT(H21),H21,IF(I21=\"\",\"\",IF((H21+I21)/2<=Basis!$M$27,\"Uit\",(100-((H21+I21)/2/Basis!$L$27*100))*Basis!$Y$19))))","v":""},null,null,"","","",{"$f":"IF(N21=\"\",\"\",IF(N21*60+O21>Basis!$U$27,\"Uit\",BL21+BM21))","v":""},null,"",null,null,"","",null,"",null,"-","-","-","-","-","-","-","-","-","-","-","-","-","-","-","-","-","-","-","-","-","-","-","-","",null,null,"",null,null,null,"","","",null,{"$f":"IF(K21=\"\",\"\",IF(ISTEXT(K21),K21,IF(K21>Basis!$N$27,\"Uit\",IF(ISBLANK(L21),K21,K21+L21))))","v":""},"","",{"$f":"IF(N21=\"\",\"\",IF(BK21<=Basis!$F$27,0,(BK21-Basis!$F$27)*0.4))","v":""},{"$f":"IF(N21=\"\",\"\",IF(BK21>Basis!$G$27,0,(Basis!$G$27-BK21)*0.4))","v":""},""]
[null,null,null,null,null,null,null,null,null,{"$f":"IF(H22=\"\",\"\",IF(ISTEXT(H22),H22,IF(I22=\"\",\"\",IF((H22+I22)/2<=Basis!$M$27,\"Uit\",(100-((H22+I22)/2/Basis!$L$27*100))*Basis!$Y$19))))","v":""},null,null,"","","",{"$f":"IF(N22=\"\",\"\",IF(N22*60+O22>Basis!$U$27,\"Uit\",BL22+BM22))","v":""},null,"",null,null,"","",null,"",null,"-","-","-","-","-","-","-","-","-","-","-","-","-","-","-","-","-","-","-","-","-","-","-","-","",null,null,"",null,null,null,"","","",null,{"$f":"IF(K22=\"\",\"\",IF(ISTEXT(K22),K22,IF(K22>Basis!$N$27,\"Uit\",IF(ISBLANK(L22),K22,K22+L22))))","v":""},"","",{"$f":"IF(N22=\"\",\"\",IF(BK22<=Basis!$F$27,0,(BK22-Basis!$F$27)*0.4))","v":""},{"$f":"IF(N22=\"\",\"\",IF(BK22>Basis!$G$27,0,(Basis!$G$27-BK22)*0.4))","v":""},""]
[null,null,null,null,null,null,null,null,null,{"$f":"IF(H23=\"\",\"\",IF(ISTEXT(H23),H23,IF(I23=\"\",\"\",IF((H23+I23)/2<=Basis!$M$27,\"Uit\",(100-((H23+I23)/2/Basis!$L$27*100))*Basis!$Y$19))))","v":""},null,null,"","","",{"$f":"IF(N23=\"\",\"\",IF(N23*60+O23>Basis!$U$27,\"Uit\",BL23+BM23))","v":""},null,"",null,null,"","",null,"",null,"-","-","-","-","-","-","-","-","-","-","-","-","-","-","-","-","-","-","-","-","-","-","-","-","",null,null,"",null,null,null,"","","",null,{"$f":"IF(K23=\"\",\"\",IF(ISTEXT(K23),K23,IF(K23>Basis!$N$27,\"Uit\",IF(ISBLANK(L23),K23,K23+L23))))","v":""},"","",{"$f":"IF(N23=\"\",\"\",IF(BK23<=Basis!$F$27,0,(BK23-Basis!$F$27)*0.4))","v":""},{"$f":"IF(N23=\"\",\"\",IF(BK23>Basis!$G$27,0,(Basis!$G$27-BK23)*0.4))","v":""},""]
[null,null,null,null,null,null,null,null,null,{"$f":"IF(H24=\"\",\"\",IF(ISTEXT(H24),H24,IF(I24=\"\",\"\",IF((H24+I24)/2<=Basis!$M$27,\"Uit\",(100-((H24+I24)/2/Basis!$L$27*100))*Basis!$Y$19))))","v":""},null,null,"","","",{"$f":"IF(N24=\"\",\"\",IF(N24*60+O24>Basis!$U$27,\"Uit\",BL24+BM24))","v":""},null,"",null,null,"","",null,"",null,"-","-","-","-","-","-","-","-","-","-","-","-","-","-","-","-","-","-","-","-","-","-","-","-","",null,null,"",null,null,null,"","","",null,{"$f":"IF(K24=\"\",\"\",IF(ISTEXT(K24),K24,IF(K24>Basis!$N$27,\"Uit\",IF(ISBLANK(L24),K24,K24+L24))))","v":""},"","",{"$f":"IF(N24=\"\",\"\",IF(BK24<=Basis!$F$27,0,(BK24-Basis!$F$27)*0.4))","v":""},{"$f":"IF(N24=\"\",\"\",IF(BK24>Basis!$G$27,0,(Basis!$G$27-BK24)*0.4))","v":""},""]
[null,null,null,null,null,null,null,null,null,{"$f":"IF(H25=\"\",\"\",IF(ISTEXT(H25),H25,IF(I25=\"\",\"\",IF((H25+I25)/2<=Basis!$M$27,\"Uit\",(100-((H25+I25)/2/Basis!$L$27*100))*Basis!$Y$19))))","v":""},null,null,"","","",{"$f":"IF(N25=\"\",\"\",IF(N25*60+O25>Basis!$U$27,\"Uit\",BL25+BM25))","v":""},null,"",null,null,"","",null,"",null,"-","-","-","-","-","-","-","-","-","-","-","-","-","-","-","-","-","-","-","-","-","-","-","-","",null,null,"",null,null,null,"","","",null,{"$f":"IF(K25=\"\",\"\",IF(ISTEXT(K25),K25,IF(K25>Basis!$N$27,\"Uit\",IF(ISBLANK(L25),K25,K25+L25))))","v":""},"","",{"$f":"IF(N25=\"\",\"\",IF(BK25<=Basis!$F$27,0,(BK25-Basis!$F$27)*0.4))","v":""},{"$f":"IF(N25=\"\",\"\",IF(BK25>Basis!$G$27,0,(Basis!$G$27-BK25)*0.4))","v":""},""]
[null,null,null,null,null,null,null,null,null,{"$f":"IF(H26=\"\",\"\",IF(ISTEXT(H26),H26,IF(I26=\"\",\"\",IF((H26+I26)/2<=Basis!$M$27,\"Uit\",(100-((H26+I26)/2/Basis!$L$27*100))*Basis!$Y$19))))","v":""},null,null,"","","",{"$f":"IF(N26=\"\",\"\",IF(N26*60+O26>Basis!$U$27,\"Uit\",BL26+BM26))","v":""},null,"",null,null,"","",null,"",null,"-","-","-","-","-","-","-","-","-","-","-","-","-","-","-","-","-","-","-","-","-","-","-","-","",null,null,"",null,null,null,"","","",null,{"$f":"IF(K26=\"\",\"\",IF(ISTEXT(K26),K26,IF(K26>Basis!$N$27,\"Uit\",IF(ISBLANK(L26),K26,K26+L26))))","v":""},"","",{"$f":"IF(N26=\"\",\"\",IF(BK26<=Basis!$F$27,0,(BK26-Basis!$F$27)*0.4))","v":""},{"$f":"IF(N26=\"\",\"\",IF(BK26>Basis!$G$27,0,(Basis!$G$27-BK26)*0.4))","v":""},""]
[null,null,null,null,null,null,null,null,null,{"$f":"IF(H27=\"\",\"\",IF(ISTEXT(H27),H27,IF(I27=\"\",\"\",IF((H27+I27)/2<=Basis!$M$27,\"Uit\",(100-((H27+I27)/2/Basis!$L$27*100))*Basis!$Y$19))))","v":""},null,null,"","","",{"$f":"IF(N27=\"\",\"\",IF(N27*60+O27>Basis!$U$27,\"Uit\",BL27+BM27))","v":""},null,"",null,null,"","",null,"",null,"-","-","-","-","-","-","-","-","-","-","-","-","-","-","-","-","-","-","-","-","-","-","-","-","",null,null,"",null,null,null,"","","",null,{"$f":"IF(K27=\"\",\"\",IF(ISTEXT(K27),K27,IF(K27>Basis!$N$27,\"Uit\",IF(ISBLANK(L27),K27,K27+L27))))","v":""},"","",{"$f":"IF(N27=\"\",\"\",IF(BK27<=Basis!$F$27,0,(BK27-Basis!$F$27)*0.4))","v":""},{"$f":"IF(N27=\"\",\"\",IF(BK27>Basis!$G$27,0,(Basis!$G$27-BK27)*0.4))","v":""},""]
[null,null,null,null,null,null,null,null,null,{"$f":"IF(H28=\"\",\"\",IF(ISTEXT(H28),H28,IF(I28=\"\",\"\",IF((H28+I28)/2<=Basis!$M$27,\"Uit\",(100-((H28+I28)/2/Basis!$L$27*100))*Basis!$Y$19))))","v":""},null,null,"","","",{"$f":"IF(N28=\"\",\"\",IF(N28*60+O28>Basis!$U$27,\"Uit\",BL28+BM28))","v":""},null,"",null,null,"","",null,"",null,"-","-","-","-","-","-","-","-","-","-","-","-","-","-","-","-","-","-","-","-","-","-","-","-","",null,null,"",null,null,null,"","","",null,{"$f":"IF(K28=\"\",\"\",IF(ISTEXT(K28),K28,IF(K28>Basis!$N$27,\"Uit\",IF(ISBLANK(L28),K28,K28+L28))))","v":""},"","",{"$f":"IF(N28=\"\",\"\",IF(BK28<=Basis!$F$27,0,(BK28-Basis!$F$27)*0.4))","v":""},{"$f":"IF(N28=\"\",\"\",IF(BK28>Basis!$G$27,0,(Basis!$G$27-BK28)*0.4))","v":""},""]
[null,null,null,null,null,null,null,null,null,{"$f":"IF(H29=\"\",\"\",IF(ISTEXT(H29),H29,IF(I29=\"\",\"\",IF((H29+I29)/2<=Basis!$M$27,\"Uit\",(100-((H29+I29)/2/Basis!$L$27*100))*Basis!$Y$19))))","v":""},null,null,"","","",{"$f":"IF(N29=\"\",\"\",IF(N29*60+O29>Basis!$U$27,\"Uit\",BL29+BM29))","v":""},null,"",null,null,"","",null,"",null,"-","-","-","-","-","-","-","-","-","-","-","-","-","-","-","-","-","-","-","-","-","-","-","-","",null,null,"",null,null,null,"","","",null,{"$f":"IF(K29=\"\",\"\",IF(ISTEXT(K29),K29,IF(K29>Basis!$N$27,\"Uit\",IF(ISBLANK(L29),K29,K29+L29))))","v":""},"","",{"$f":"IF(N29=\"\",\"\",IF(BK29<=Basis!$F$27,0,(BK29-Basis!$F$27)*0.4))","v":""},{"$f":"IF(N29=\"\",\"\",IF(BK29>Basis!$G$27,0,(Basis!$G$27-BK29)*0.4))","v":""},""]
["  Bij uitsluiting reden vermelden : ",null,null,null,null,null,null,null,null,null,null,null,null,null,null,{"$f":"NOW()","v":"2018-06-30T22:02:24.880"},null,null,null,null,null,null,null,{"$f":"A30","v":"  Bij uitsluiting reden vermelden : "},null,null,null,null,null,null,null,null,null,null,null,null,null,null,null,null,null,null,null,null,null,null,{"$f":"NOW()","v":"2018-06-30T22:02:24.880"}]
["  VP=val paard, VR=val ruiter, 3W=3 weigeringen op zelfde hindernis, 4W=4 weigeringen totaal, FP=foutief parcours, Vr.v= vrijwillig verlaten",null,null,null,null,null,null,null,null,null,null,null,null,null,null,null,null,null,null,null,null,null,null,{"$f":"A31","v":"  VP=val paard, VR=val ruiter, 3W=3 weigeringen op zelfde hindernis, 4W=4 weigeringen totaal, FP=foutief parcours, Vr.v= vrijwillig verlaten"}]